program: Orca
programVersion: 5.0.2
elementType: Cl F F F O O O N N C C C C C C C C C C C C C C C C C C C C C C C C C C H H H H H H H H H H H H H H H H H H H H H H
charge: 0
multiplicity: 1
keywords: wb97x-d3
keywords: def2-TZVPP
keywords: def2/J RIJCOSX
keywords: DEFGRID2
keywords: scfconv7
keywords: smallprint printgap noloewdin
keywords: NOSOSCF
formula: C26H22ClF3N2O3
InChI: InChI=1/C26H22ClF3N2O3/c1-16(2)24(32-22-12-11-18(14-21(22)27)26(28,29)30)25(33)35-23(15-31)17-7-6-10-20(13-17)34-19-8-4-3-5-9-19/h3-14,16,23-24,32H,1-2H3
57 atoms
Cl 0.648044 4.896022 -0.828185
F  -4.474892 2.115231 -0.305606
F  -3.949926 2.900492 -2.236557
F  -3.862143 0.780461 -1.870883
O  2.509478 -0.891339 0.098578
O  3.09419 0.710886 -1.347902
O  -1.769729 -3.795679 0.184029
N  1.743817 2.461129 0.481867
N  5.06856 -2.425876 -1.440973
C  3.88971 1.822083 1.454189
C  2.531555 1.33852 0.915157
C  3.681759 2.719734 2.667705
C  4.798822 0.649055 1.804785
C  2.747375 0.377929 -0.248542
C  0.461231 2.332851 0.0405
C  2.564781 -1.879097 -0.93061
C  -0.197779 3.398095 -0.598392
C  -0.279139 1.153922 0.215392
C  1.757467 -3.061043 -0.455283
C  -2.195908 2.107052 -0.883165
C  -1.495715 3.294483 -1.0524
C  -1.576102 1.043076 -0.240409
C  0.382747 -2.875705 -0.347753
C  2.327179 -4.281674 -0.124416
C  -3.611692 1.979824 -1.327292
C  -0.411617 -3.914472 0.110185
C  3.967048 -2.19582 -1.212334
C  1.514567 -5.319354 0.312025
C  0.147975 -5.141424 0.441251
C  -2.341985 -2.742791 0.842386
C  -1.750362 -2.128399 1.939886
C  -3.597363 -2.343702 0.400396
C  -2.429552 -1.10624 2.589725
C  -4.266253 -1.327468 1.066172
C  -3.685139 -0.700253 2.160287
H  4.370216 2.405056 0.659903
H  2.017118 0.812327 1.724213
H  3.08521 3.60253 2.437938
H  4.642976 3.067124 3.04807
H  3.181892 2.178263 3.473803
H  4.324758 -0.025869 2.520227
H  5.717927 1.017242 2.261272
H  5.097056 0.064461 0.932391
H  2.26992 3.243029 0.121058
H  2.128996 -1.486239 -1.854669
H  0.153909 0.303601 0.723063
H  -1.947866 4.147269 -1.540665
H  -2.097108 0.106572 -0.088713
H  -0.065898 -1.928961 -0.628399
H  3.394732 -4.440269 -0.206024
H  1.95526 -6.274532 0.564127
H  -0.484977 -5.947564 0.789681
H  -0.778824 -2.442603 2.300361
H  -4.047923 -2.833863 -0.453744
H  -1.968385 -0.628879 3.444775
H  -5.246147 -1.023931 0.721174
H  -4.206921 0.095785 2.674446
elementType: Cl F O N C H
totalener: -2099.13418665 hartree
nucrepener: 3981.99777837 hartree
electener: -6081.13196502 hartree
twoeener: 4716.05413745 hartree
cpcmener: -0.03551506 hartree
kineticenergy: 2091.79448590 hartree
xcener: -173.911099758559 hartree
chargesum: -0.0000000
charge: -0.096350 -0.188115 -0.182869 -0.187159 -0.254271 -0.411323 -0.326678 -0.220821 -0.081514 0.082510 0.098015 -0.290837 -0.298351 0.304849 0.216794 0.433813 -0.056587 -0.211254 -0.041254 -0.151851 -0.069558 -0.102344 -0.201822 -0.161757 0.557408 0.226394 -0.234578 -0.119266 -0.215479 0.289839 -0.191137 -0.205452 -0.167110 -0.148723 -0.167658 0.060770 0.115071 0.091617 0.096287 0.087089 0.096493 0.095314 0.091302 0.152419 0.142512 0.142078 0.127204 0.109788 0.159570 0.138624 0.160396 0.148435 0.152878 0.142847 0.156137 0.152986 0.154676
qa: -0.0963 -0.1881 -0.1829 -0.1872 -0.2543 -0.4113 -0.3267 -0.2208 -0.0815 0.0825 0.0980 -0.2908 -0.2984 0.3048 0.2168 0.4338 -0.0566 -0.2113 -0.0413 -0.1519 -0.0696 -0.1023 -0.2018 -0.1618 0.5574 0.2264 -0.2346 -0.1193 -0.2155 0.2898 -0.1911 -0.2055 -0.1671 -0.1487 -0.1677 0.0608 0.1151 0.0916 0.0963 0.0871 0.0965 0.0953 0.0913 0.1524 0.1425 0.1421 0.1272 0.1098 0.1596 0.1386 0.1604 0.1484 0.1529 0.1428 0.1561 0.1530 0.1547
va: 1.2324 1.0973 1.1178 1.1092 2.1331 2.1006 2.0832 3.2014 3.1026 3.8021 3.8650 3.9362 3.9480 4.1171 3.8978 3.7066 3.9373 3.9319 3.7968 3.8017 3.9731 3.9982 3.9667 3.9079 4.4165 3.7731 4.0329 3.9253 4.0175 3.6753 3.8303 3.9414 3.8636 3.8627 3.8374 1.0276 1.0137 1.0188 1.0054 1.0018 1.0041 1.0044 1.0089 1.0447 1.0121 1.0063 1.0254 1.0066 0.9938 1.0150 0.9899 1.0042 1.0000 1.0090 0.9926 0.9948 0.9923
dispcorr: -0.036018035 hartree
energy: -2099.170204681017
dipole: 30.66983 -30.58501 0.08483 -18.03952 17.55653 -0.48299 27.51738 -25.41855 2.09883
magnitude: 2.15536 au
magnitude: 5.47848 debye
