program: Orca
programVersion: 5.0.2
elementType: Cl F F F O O O N N C C C C C C C C C C C C C C C C C C C C C C C C C C H H H H H H H H H H H H H H H H H H H H H H
charge: 0
multiplicity: 1
keywords: wb97x-d3
keywords: def2-TZVPP
keywords: def2/J RIJCOSX
keywords: DEFGRID2
keywords: scfconv7
keywords: smallprint printgap noloewdin
keywords: NOSOSCF
formula: C26H22ClF3N2O3
InChI: InChI=1/C26H22ClF3N2O3/c1-16(2)24(32-22-12-11-18(14-21(22)27)26(28,29)30)25(33)35-23(15-31)17-7-6-10-20(13-17)34-19-8-4-3-5-9-19/h3-14,16,23-24,32H,1-2H3
57 atoms
Cl 0.61222 4.882038 -0.316787
F  -4.548993 2.0025 -0.327092
F  -3.971102 3.126729 -2.068044
F  -3.839398 0.977206 -2.069517
O  2.664719 -1.038466 0.078001
O  2.634695 0.699278 -1.338504
O  -1.73484 -3.702925 -0.107332
N  1.646876 2.293221 0.733529
N  5.254743 -2.593455 -1.322359
C  3.752818 1.422005 1.682519
C  2.388333 1.102604 1.035109
C  4.699169 2.203485 0.776825
C  3.546952 2.139717 3.011522
C  2.576826 0.263687 -0.223247
C  0.379257 2.239034 0.236471
C  2.737493 -1.97886 -0.992026
C  -0.253615 3.37769 -0.290148
C  -0.371952 1.054301 0.239646
C  1.843469 -3.145936 -0.647395
C  -2.246882 2.147019 -0.798994
C  -1.536784 3.341097 -0.796725
C  -1.651376 1.009062 -0.270241
C  0.483083 -2.87783 -0.523266
C  2.3212 -4.435636 -0.467284
C  -3.642022 2.070015 -1.31752
C  -0.386666 -3.904688 -0.19265
C  4.145124 -2.339205 -1.174109
C  1.433152 -5.458145 -0.159977
C  0.081716 -5.199459 -0.009879
C  -2.252562 -2.717877 0.685893
C  -1.59863 -2.219523 1.806699
C  -3.523693 -2.264325 0.350787
C  -2.227234 -1.254812 2.583513
C  -4.141168 -1.308687 1.143299
C  -3.495619 -0.794799 2.260558
H  4.213317 0.45239 1.893385
H  1.83445 0.50239 1.76284
H  4.923634 1.681078 -0.153783
H  5.648783 2.357637 1.290914
H  4.317662 3.195441 0.522936
H  3.125399 3.137127 2.876554
H  4.50133 2.256036 3.526731
H  2.881733 1.580672 3.671832
H  2.188367 3.10995 0.495834
H  2.397318 -1.522273 -1.926746
H  0.038649 0.143806 0.652783
H  -1.966185 4.251593 -1.19255
H  -2.177362 0.063705 -0.25246
H  0.102315 -1.87628 -0.692342
H  3.375396 -4.660493 -0.566488
H  1.803123 -6.465747 -0.023791
H  -0.610136 -5.994136 0.238959
H  -0.615345 -2.575557 2.087006
H  -4.024096 -2.66231 -0.523325
H  -1.714331 -0.866423 3.454141
H  -5.131335 -0.960796 0.878759
H  -3.975859 -0.04264 2.872287
elementType: Cl F O N C H
totalener: -2099.13247225 hartree
nucrepener: 3988.22998611 hartree
electener: -6087.36245835 hartree
twoeener: 4722.33757147 hartree
cpcmener: -0.03590473 hartree
kineticenergy: 2091.77798191 hartree
xcener: -173.910935082647 hartree
chargesum: 0.0000000
charge: -0.098769 -0.187710 -0.182827 -0.188620 -0.263640 -0.406701 -0.325145 -0.251503 -0.079293 0.055737 0.149707 -0.293901 -0.293634 0.298347 0.193826 0.435522 -0.053493 -0.205635 -0.048958 -0.141400 -0.066987 -0.115974 -0.209604 -0.165221 0.554873 0.242259 -0.244117 -0.110943 -0.222345 0.302002 -0.205875 -0.205667 -0.165232 -0.152599 -0.166272 0.060764 0.127920 0.093721 0.102080 0.083609 0.083982 0.099581 0.094784 0.159790 0.145005 0.132656 0.127159 0.135095 0.167229 0.137878 0.160578 0.147825 0.153977 0.142489 0.156283 0.151683 0.155704
qa: -0.0988 -0.1877 -0.1828 -0.1886 -0.2636 -0.4067 -0.3251 -0.2515 -0.0793 0.0557 0.1497 -0.2939 -0.2936 0.2983 0.1938 0.4355 -0.0535 -0.2056 -0.0490 -0.1414 -0.0670 -0.1160 -0.2096 -0.1652 0.5549 0.2423 -0.2441 -0.1109 -0.2223 0.3020 -0.2059 -0.2057 -0.1652 -0.1526 -0.1663 0.0608 0.1279 0.0937 0.1021 0.0836 0.0840 0.0996 0.0948 0.1598 0.1450 0.1327 0.1272 0.1351 0.1672 0.1379 0.1606 0.1478 0.1540 0.1425 0.1563 0.1517 0.1557
va: 1.2286 1.0988 1.1180 1.1083 2.1386 2.0963 2.0881 3.2251 3.1127 3.8195 3.8070 3.9548 3.9383 4.1957 3.9183 3.6975 3.9372 3.9585 3.8183 3.7957 3.9674 3.9642 3.9649 3.9072 4.4212 3.7536 4.0768 3.9148 4.0202 3.6619 3.8213 3.9314 3.8622 3.8673 3.8418 1.0250 1.0101 1.0148 1.0024 1.0030 1.0123 1.0037 1.0043 1.0375 1.0221 1.0053 1.0246 1.0039 0.9869 1.0155 0.9896 1.0045 0.9998 1.0097 0.9926 0.9967 0.9913
dispcorr: -0.036184607 hartree
energy: -2099.168656854815
dipole: 30.59457 -30.24448 0.35009 -17.02005 16.31143 -0.70863 24.45788 -22.46330 1.99458
magnitude: 2.14547 au
magnitude: 5.45336 debye
