program: Orca
programVersion: 5.0.2
elementType: Cl F F F O O O N N C C C C C C C C C C C C C C C C C C C C C C C C C C H H H H H H H H H H H H H H H H H H H H H H
charge: 0
multiplicity: 1
keywords: wb97x-d3
keywords: def2-TZVPP
keywords: def2/J RIJCOSX
keywords: DEFGRID2
keywords: scfconv7
keywords: smallprint printgap noloewdin
keywords: NOSOSCF
formula: C26H22ClF3N2O3
InChI: InChI=1/C26H22ClF3N2O3/c1-16(2)24(32-22-12-11-18(14-21(22)27)26(28,29)30)25(33)35-23(15-31)17-7-6-10-20(13-17)34-19-8-4-3-5-9-19/h3-14,16,23-24,32H,1-2H3
57 atoms
Cl -0.471143 3.695368 -1.585679
F  -3.071537 0.234051 2.988988
F  -3.786249 2.211154 2.527013
F  -3.969691 0.641569 1.07639
O  3.287519 -0.932538 -0.004412
O  1.787687 -0.224436 -1.504901
O  -2.021425 -2.847094 -0.034407
N  1.870387 2.30116 -0.368573
N  4.782576 -3.804437 0.669472
C  4.239866 1.923878 -0.94757
C  2.990284 1.414532 -0.200704
C  4.076545 1.97373 -2.46329
C  4.661444 3.28114 -0.396422
C  2.609797 0.012754 -0.663365
C  0.674398 2.046345 0.240698
C  2.844744 -2.281685 -0.190528
C  -0.52198 2.629167 -0.215818
C  0.57046 1.207183 1.357916
C  1.568076 -2.513028 0.582332
C  -1.815154 1.491379 1.452379
C  -1.740568 2.356061 0.36525
C  -0.647376 0.934416 1.950165
C  0.374983 -2.649089 -0.110498
C  1.577267 -2.482987 1.973783
C  -3.151256 1.145632 2.013868
C  -0.819521 -2.712222 0.59623
C  3.93883 -3.120388 0.297797
C  0.382005 -2.589574 2.664828
C  -0.822173 -2.686746 1.981952
C  -2.346707 -2.057531 -1.103241
C  -3.309361 -2.564657 -1.967362
C  -1.80285 -0.79629 -1.315127
C  -3.725501 -1.805769 -3.050153
C  -2.221413 -0.054779 -2.411588
C  -3.180009 -0.550267 -3.28317
H  5.033081 1.206828 -0.717068
H  3.262335 1.362428 0.856883
H  3.838349 1.002035 -2.896279
H  5.010296 2.304855 -2.919103
H  3.305996 2.680003 -2.78075
H  3.939446 4.061544 -0.640074
H  5.620516 3.577668 -0.822716
H  4.775705 3.257143 0.688539
H  1.813637 2.753973 -1.268438
H  2.706794 -2.509715 -1.25175
H  1.453198 0.749295 1.782337
H  -2.632762 2.809607 -0.048103
H  -0.661016 0.27148 2.803608
H  0.376634 -2.685948 -1.192545
H  2.506634 -2.3776 2.520543
H  0.381704 -2.574754 3.746564
H  -1.758979 -2.745163 2.521419
H  -3.7318 -3.545257 -1.786605
H  -1.062286 -0.382101 -0.644078
H  -4.477553 -2.205136 -3.718321
H  -1.79166 0.924801 -2.577875
H  -3.500907 0.036247 -4.133841
elementType: Cl F O N C H
totalener: -2099.13131880 hartree
nucrepener: 4146.75839597 hartree
electener: -6245.88971477 hartree
twoeener: 4881.77038153 hartree
cpcmener: -0.03644896 hartree
kineticenergy: 2091.79952120 hartree
xcener: -173.915859496699 hartree
chargesum: 0.0000000
charge: -0.103177 -0.185077 -0.187426 -0.186893 -0.260520 -0.412896 -0.328199 -0.252308 -0.083304 0.061857 0.155931 -0.300649 -0.297016 0.286223 0.175616 0.401461 0.024210 -0.177221 0.047371 -0.035501 -0.201437 -0.193841 -0.209538 -0.241641 0.568481 0.317616 -0.227815 -0.117383 -0.242985 0.305555 -0.248578 -0.147845 -0.122446 -0.157220 -0.192888 0.061586 0.124417 0.094371 0.102545 0.083207 0.084047 0.099331 0.094906 0.158696 0.140151 0.144320 0.124781 0.158247 0.143851 0.142683 0.159921 0.145853 0.143323 0.095182 0.156530 0.155935 0.155599
qa: -0.1032 -0.1851 -0.1874 -0.1869 -0.2605 -0.4129 -0.3282 -0.2523 -0.0833 0.0619 0.1559 -0.3006 -0.2970 0.2862 0.1756 0.4015 0.0242 -0.1772 0.0474 -0.0355 -0.2014 -0.1938 -0.2095 -0.2416 0.5685 0.3176 -0.2278 -0.1174 -0.2430 0.3056 -0.2486 -0.1478 -0.1224 -0.1572 -0.1929 0.0616 0.1244 0.0944 0.1025 0.0832 0.0840 0.0993 0.0949 0.1587 0.1402 0.1443 0.1248 0.1582 0.1439 0.1427 0.1599 0.1459 0.1433 0.0952 0.1565 0.1559 0.1556
va: 1.2164 1.1146 1.1069 1.1016 2.1562 2.0795 2.0902 3.2264 3.1117 3.8132 3.8278 3.9557 3.9405 4.2048 3.8773 3.7570 3.8196 3.8700 3.5273 3.5598 4.0868 3.9590 3.9549 3.9472 4.4053 3.6589 4.0722 3.8508 3.9752 3.7110 3.9814 3.8139 3.8946 3.8988 3.9376 1.0235 1.0119 1.0141 1.0025 1.0029 1.0116 1.0039 1.0045 1.0401 1.0144 1.0094 1.0282 1.0047 1.0138 1.0103 0.9887 1.0096 1.0097 1.0094 0.9886 0.9947 0.9914
dispcorr: -0.040541137 hartree
energy: -2099.171859936240
dipole: 33.73850 -32.38767 1.35084 -0.77370 1.94290 1.16920 -15.76760 15.36465 -0.40295
magnitude: 1.83144 au
magnitude: 4.65514 debye
