program: Orca
programVersion: 5.0.2
elementType: Cl F F F O O O N N C C C C C C C C C C C C C C C C C C C C C C C C C C H H H H H H H H H H H H H H H H H H H H H H
charge: 0
multiplicity: 1
keywords: wb97x-d3
keywords: def2-TZVPP
keywords: def2/J RIJCOSX
keywords: DEFGRID2
keywords: scfconv7
keywords: smallprint printgap noloewdin
keywords: NOSOSCF
formula: C26H22ClF3N2O3
InChI: InChI=1/C26H22ClF3N2O3/c1-16(2)24(32-22-12-11-18(14-21(22)27)26(28,29)30)25(33)35-23(15-31)17-7-6-10-20(13-17)34-19-8-4-3-5-9-19/h3-14,16,23-24,32H,1-2H3
57 atoms
Cl -0.333766 3.414615 -1.055353
F  -2.326231 3.961835 3.830568
F  -2.721347 1.858036 3.679038
F  -1.283528 2.578539 5.107796
O  1.781413 -0.21431 -0.179212
O  3.877347 -0.873775 0.205153
O  -2.846826 -2.637474 -2.512263
N  2.282569 2.346804 -0.126335
N  1.793021 -2.629855 2.230431
C  4.401987 1.745173 -1.219011
C  3.431092 1.487907 -0.0486
C  3.791759 1.427688 -2.581483
C  4.937109 3.170007 -1.170199
C  3.081063 0.004215 0.006691
C  1.328793 2.414222 0.845427
C  1.286459 -1.542317 -0.094994
C  0.046697 2.922854 0.56613
C  1.56138 2.002125 2.164502
C  -0.209709 -1.457983 -0.265277
C  -0.661623 2.634507 2.838526
C  -0.927334 3.033858 1.533143
C  0.588463 2.111344 3.139822
C  -0.812006 -2.128732 -1.317863
C  -0.963565 -0.689809 0.616565
C  -1.737459 2.75639 3.863117
C  -2.191436 -2.042877 -1.476744
C  1.604385 -2.137549 1.210205
C  -2.332761 -0.600067 0.4337
C  -2.953639 -1.278867 -0.605235
C  -2.429916 -3.846632 -3.002132
C  -2.073262 -4.897817 -2.166268
C  -2.43936 -4.006516 -4.380095
C  -1.716062 -6.115381 -2.727256
C  -2.091365 -5.233967 -4.926072
C  -1.723099 -6.290227 -4.104811
H  5.24241 1.065325 -1.058701
H  3.987305 1.693703 0.871851
H  2.978015 2.106211 -2.847168
H  3.410592 0.406603 -2.646432
H  4.550029 1.53317 -3.358094
H  4.156277 3.907047 -1.362231
H  5.710566 3.307427 -1.926915
H  5.38212 3.39782 -0.200119
H  1.963093 2.545389 -1.061982
H  1.7327 -2.172864 -0.870011
H  2.522723 1.593291 2.444987
H  -1.896026 3.430895 1.257071
H  0.830171 1.781224 4.14096
H  -0.206883 -2.704649 -2.007656
H  -0.49317 -0.167631 1.441067
H  -2.926449 -0.003458 1.113877
H  -4.025687 -1.21494 -0.742602
H  -2.077364 -4.777655 -1.089995
H  -2.723451 -3.178522 -5.017413
H  -1.436962 -6.934819 -2.07759
H  -2.103266 -5.359098 -6.0011
H  -1.446952 -7.244269 -4.534038
elementType: Cl F O N C H
totalener: -2099.13262118 hartree
nucrepener: 3904.32592873 hartree
electener: -6003.45854990 hartree
twoeener: 4638.95047640 hartree
cpcmener: -0.03889753 hartree
kineticenergy: 2091.79061603 hartree
xcener: -173.911347802973 hartree
chargesum: -0.0000000
charge: -0.097738 -0.187047 -0.184935 -0.181990 -0.241711 -0.415992 -0.325164 -0.250116 -0.078209 0.065874 0.120481 -0.298299 -0.300415 0.322955 0.165681 0.370380 0.024225 -0.216282 0.039901 -0.062869 -0.179501 -0.132501 -0.165628 -0.270024 0.556396 0.256626 -0.238332 -0.134388 -0.209887 0.279922 -0.191816 -0.247904 -0.140848 -0.120825 -0.185001 0.057938 0.131840 0.082126 0.095184 0.103622 0.083656 0.099334 0.094599 0.157483 0.138082 0.142321 0.125597 0.147215 0.145576 0.170764 0.150923 0.147694 0.157653 0.146856 0.160050 0.157967 0.158498
qa: -0.0977 -0.1870 -0.1849 -0.1820 -0.2417 -0.4160 -0.3252 -0.2501 -0.0782 0.0659 0.1205 -0.2983 -0.3004 0.3230 0.1657 0.3704 0.0242 -0.2163 0.0399 -0.0629 -0.1795 -0.1325 -0.1656 -0.2700 0.5564 0.2566 -0.2383 -0.1344 -0.2099 0.2799 -0.1918 -0.2479 -0.1408 -0.1208 -0.1850 0.0579 0.1318 0.0821 0.0952 0.1036 0.0837 0.0993 0.0946 0.1575 0.1381 0.1423 0.1256 0.1472 0.1456 0.1708 0.1509 0.1477 0.1577 0.1469 0.1601 0.1580 0.1585
va: 1.2292 1.1089 1.0974 1.1201 2.1704 2.0967 2.0833 3.2053 3.1095 3.8152 3.8786 3.9519 3.9420 4.2191 3.8454 3.7779 3.8512 3.8994 3.6576 3.6032 4.0832 3.9687 3.8967 3.9524 4.4240 3.7618 4.0408 3.9387 4.0280 3.6929 3.9161 4.0111 3.8885 3.8831 3.9063 1.0299 1.0002 1.0035 1.0115 1.0020 1.0124 1.0034 1.0039 1.0426 1.0142 1.0087 1.0282 1.0083 1.0057 0.9864 1.0018 1.0058 0.9963 1.0078 0.9900 0.9892 0.9904
dispcorr: -0.034308929 hartree
energy: -2099.166930105164
dipole: 27.98403 -27.11794 0.86609 -19.34505 19.71295 0.36790 -34.63800 31.98760 -2.65040
magnitude: 2.81249 au
magnitude: 7.14878 debye
