program: Orca
programVersion: 5.0.2
elementType: Cl F F F O O O N N C C C C C C C C C C C C C C C C C C C C C C C C C C H H H H H H H H H H H H H H H H H H H H H H
charge: 0
multiplicity: 1
keywords: wb97x-d3
keywords: def2-TZVPP
keywords: def2/J RIJCOSX
keywords: DEFGRID2
keywords: scfconv7
keywords: smallprint printgap noloewdin
keywords: NOSOSCF
formula: C26H22ClF3N2O3
InChI: InChI=1/C26H22ClF3N2O3/c1-16(2)24(32-22-12-11-18(14-21(22)27)26(28,29)30)25(33)35-23(15-31)17-7-6-10-20(13-17)34-19-8-4-3-5-9-19/h3-14,16,23-24,32H,1-2H3
57 atoms
Cl -0.442076 3.287106 -1.070468
F  -2.300146 3.920024 3.890034
F  -2.739863 1.829948 3.693393
F  -1.269871 2.487045 5.120944
O  1.79416 -0.221651 -0.157616
O  3.920179 -0.826824 0.14487
O  -2.843431 -2.581058 -2.415836
N  2.230196 2.349841 -0.163411
N  1.970687 -2.604399 2.275951
C  4.350618 1.79813 -1.279999
C  3.402918 1.52261 -0.09546
C  3.725471 1.470559 -2.633307
C  4.859929 3.232568 -1.237804
C  3.094154 0.02999 -0.023353
C  1.290371 2.400139 0.82416
C  1.334314 -1.560564 -0.038296
C  -0.01637 2.848013 0.554976
C  1.561982 2.029859 2.147679
C  -0.167484 -1.506939 -0.160091
C  -0.67434 2.584316 2.845621
C  -0.97847 2.940322 1.535818
C  0.601657 2.122331 3.13748
C  -0.78413 -2.12313 -1.237965
C  -0.91058 -0.802991 0.781745
C  -1.734983 2.702423 3.886792
C  -2.167844 -2.048846 -1.36023
C  1.718706 -2.130017 1.260598
C  -2.285441 -0.727148 0.638578
C  -2.92008 -1.353905 -0.42386
C  -2.41846 -3.730562 -3.026543
C  -1.977301 -4.835125 -2.307735
C  -2.51397 -3.776543 -4.410072
C  -1.622348 -5.988294 -2.993007
C  -2.168026 -4.941031 -5.080103
C  -1.715906 -6.048842 -4.376995
H  5.206081 1.133979 -1.133175
H  3.965489 1.749551 0.816168
H  4.473453 1.576114 -3.419804
H  2.905221 2.144043 -2.891418
H  3.348446 0.447285 -2.687421
H  4.061264 3.954982 -1.411973
H  5.616022 3.386563 -2.009071
H  5.319324 3.465734 -0.275634
H  1.881534 2.509578 -1.096445
H  1.768061 -2.190884 -0.820709
H  2.544127 1.667922 2.41982
H  -1.967964 3.28899 1.268061
H  0.873642 1.827643 4.141743
H  -0.186039 -2.64515 -1.974939
H  -0.426939 -0.319009 1.62166
H  -2.871302 -0.180582 1.365786
H  -3.995975 -1.300549 -0.531565
H  -1.915437 -4.807898 -1.22699
H  -2.863806 -2.908872 -4.955223
H  -1.27802 -6.849071 -2.43439
H  -2.24721 -4.976149 -6.158933
H  -1.441127 -6.953723 -4.902639
elementType: Cl F O N C H
totalener: -2099.13235635 hartree
nucrepener: 3911.35894989 hartree
electener: -6010.49130624 hartree
twoeener: 4645.99844133 hartree
cpcmener: -0.03881725 hartree
kineticenergy: 2091.78650814 hartree
xcener: -173.910349459980 hartree
chargesum: -0.0000000
charge: -0.097069 -0.187158 -0.185141 -0.181759 -0.240271 -0.416314 -0.324096 -0.251477 -0.078441 0.064606 0.122787 -0.299448 -0.300921 0.323587 0.162183 0.374807 0.033790 -0.209109 0.048462 -0.058485 -0.187036 -0.143005 -0.181739 -0.284029 0.557745 0.274300 -0.239371 -0.126381 -0.218994 0.294244 -0.203549 -0.253630 -0.138089 -0.118601 -0.187258 0.057753 0.131170 0.103936 0.081732 0.096063 0.083959 0.099214 0.094253 0.157132 0.138339 0.142332 0.125490 0.147562 0.145881 0.168281 0.153239 0.147329 0.158015 0.146529 0.160045 0.158127 0.158478
qa: -0.0971 -0.1872 -0.1851 -0.1818 -0.2403 -0.4163 -0.3241 -0.2515 -0.0784 0.0646 0.1228 -0.2994 -0.3009 0.3236 0.1622 0.3748 0.0338 -0.2091 0.0485 -0.0585 -0.1870 -0.1430 -0.1817 -0.2840 0.5577 0.2743 -0.2394 -0.1264 -0.2190 0.2942 -0.2035 -0.2536 -0.1381 -0.1186 -0.1873 0.0578 0.1312 0.1039 0.0817 0.0961 0.0840 0.0992 0.0943 0.1571 0.1383 0.1423 0.1255 0.1476 0.1459 0.1683 0.1532 0.1473 0.1580 0.1465 0.1600 0.1581 0.1585
va: 1.2306 1.1076 1.0983 1.1208 2.1711 2.0963 2.0874 3.2067 3.1095 3.8172 3.8809 3.9519 3.9406 4.2231 3.8474 3.7756 3.8430 3.8931 3.6371 3.5944 4.0873 3.9649 3.9150 3.9636 4.4209 3.7502 4.0409 3.9281 4.0380 3.6815 3.9217 4.0137 3.8852 3.8817 3.9087 1.0303 1.0002 1.0021 1.0034 1.0109 1.0126 1.0034 1.0038 1.0429 1.0133 1.0082 1.0282 1.0082 1.0059 0.9879 1.0014 1.0063 0.9963 1.0083 0.9900 0.9891 0.9905
dispcorr: -0.034370876 hartree
energy: -2099.166727227203
dipole: 27.77423 -27.02829 0.74594 -18.18580 18.53842 0.35261 -35.38027 32.72054 -2.65974
magnitude: 2.78477 au
magnitude: 7.07833 debye
