program: Orca
programVersion: 5.0.2
elementType: Cl F F F O O O N N C C C C C C C C C C C C C C C C C C C C C C C C C C H H H H H H H H H H H H H H H H H H H H H H
charge: 0
multiplicity: 1
keywords: wb97x-d3
keywords: def2-TZVPP
keywords: def2/J RIJCOSX
keywords: DEFGRID2
keywords: scfconv7
keywords: smallprint printgap noloewdin
keywords: NOSOSCF
formula: C26H22ClF3N2O3
InChI: InChI=1/C26H22ClF3N2O3/c1-16(2)24(32-22-12-11-18(14-21(22)27)26(28,29)30)25(33)35-23(15-31)17-7-6-10-20(13-17)34-19-8-4-3-5-9-19/h3-14,16,23-24,32H,1-2H3
57 atoms
Cl 0.912869 5.066426 -0.607018
F  -4.083904 2.1472 1.379852
F  -4.062094 3.701869 -0.114483
F  -3.975341 1.63369 -0.701816
O  2.461498 -0.769609 -0.005622
O  2.675922 0.827279 -1.553967
O  -1.643838 -4.66125 -0.019341
N  2.126672 2.626659 0.592028
N  4.332312 -2.330951 -2.340852
C  4.408563 1.795597 0.850408
C  2.914239 1.433817 0.769511
C  4.67549 2.681985 2.06079
C  5.28125 0.546187 0.900541
C  2.676557 0.488344 -0.402557
C  0.766845 2.58748 0.484913
C  2.159929 -1.731843 -1.013438
C  0.046922 3.6705 -0.046161
C  0.013056 1.485253 0.916653
C  1.572571 -2.937232 -0.329539
C  -2.047942 2.559748 0.294492
C  -1.329531 3.664282 -0.141608
C  -1.362172 1.472514 0.822088
C  0.223159 -3.210172 -0.505857
C  2.359509 -3.738193 0.489729
C  -3.534733 2.517842 0.210987
C  -0.341963 -4.299247 0.148542
C  3.384328 -2.062832 -1.750859
C  1.782822 -4.823032 1.129848
C  0.435143 -5.106048 0.968038
C  -2.606671 -3.706292 -0.225201
C  -2.735449 -2.612386 0.621845
C  -3.494462 -3.905448 -1.271467
C  -3.7677 -1.710658 0.407518
C  -4.527554 -2.999329 -1.468854
C  -4.665121 -1.897597 -0.636523
H  4.659161 2.354476 -0.058868
H  2.637693 0.934023 1.702234
H  4.091571 3.602257 2.044635
H  5.728286 2.965957 2.091631
H  4.447567 2.156337 2.990845
H  5.004974 -0.101989 1.734816
H  6.325253 0.829591 1.037091
H  5.236886 -0.043357 -0.017022
H  2.589316 3.361603 0.076813
H  1.445294 -1.323764 -1.734756
H  0.499566 0.62418 1.352234
H  -1.826223 4.52833 -0.561524
H  -1.892683 0.59571 1.171306
H  -0.374141 -2.580942 -1.155136
H  3.412255 -3.524296 0.627712
H  2.38581 -5.454806 1.768321
H  -0.013197 -5.954337 1.469668
H  -2.047252 -2.467613 1.445789
H  -3.381937 -4.765696 -1.919438
H  -3.877626 -0.862913 1.071112
H  -5.222689 -3.156534 -2.283506
H  -5.47049 -1.192853 -0.795396
elementType: Cl F O N C H
totalener: -2099.13435201 hartree
nucrepener: 3891.74952882 hartree
electener: -5990.88388083 hartree
twoeener: 4625.94509442 hartree
cpcmener: -0.03781983 hartree
kineticenergy: 2091.78683489 hartree
xcener: -173.905011816770 hartree
chargesum: -0.0000000
charge: -0.095975 -0.190799 -0.181489 -0.185727 -0.255782 -0.409968 -0.326375 -0.234305 -0.082270 0.074345 0.111273 -0.292099 -0.297846 0.290426 0.204271 0.414577 -0.025907 -0.231975 -0.005931 -0.096871 -0.097579 -0.155615 -0.149734 -0.219919 0.565118 0.238396 -0.233509 -0.133050 -0.210369 0.265140 -0.183935 -0.238801 -0.156288 -0.121169 -0.177348 0.059696 0.116856 0.092836 0.097201 0.087156 0.096035 0.095701 0.091482 0.152413 0.128618 0.142602 0.128860 0.149317 0.144981 0.148597 0.158296 0.148216 0.158053 0.147327 0.169436 0.157640 0.155768
qa: -0.0960 -0.1908 -0.1815 -0.1857 -0.2558 -0.4100 -0.3264 -0.2343 -0.0823 0.0743 0.1113 -0.2921 -0.2978 0.2904 0.2043 0.4146 -0.0259 -0.2320 -0.0059 -0.0969 -0.0976 -0.1556 -0.1497 -0.2199 0.5651 0.2384 -0.2335 -0.1330 -0.2104 0.2651 -0.1839 -0.2388 -0.1563 -0.1212 -0.1773 0.0597 0.1169 0.0928 0.0972 0.0872 0.0960 0.0957 0.0915 0.1524 0.1286 0.1426 0.1289 0.1493 0.1450 0.1486 0.1583 0.1482 0.1581 0.1473 0.1694 0.1576 0.1558
va: 1.2327 1.1019 1.1204 1.1036 2.1573 2.0992 2.0780 3.1984 3.0987 3.8096 3.8582 3.9351 3.9472 4.1423 3.8439 3.7263 3.9355 3.9776 3.7143 3.7068 4.0104 4.0601 3.9018 3.9842 4.4030 3.7795 4.0391 3.9288 4.0010 3.7084 3.9283 4.0114 3.8646 3.8922 3.9081 1.0280 1.0117 1.0180 1.0048 1.0017 1.0041 1.0048 1.0097 1.0455 1.0218 1.0149 1.0248 1.0023 1.0061 1.0065 0.9901 1.0054 0.9975 1.0069 0.9869 0.9889 0.9959
dispcorr: -0.033076750 hartree
energy: -2099.167428758112
dipole: 32.92885 -32.64203 0.28682 -22.83725 22.48176 -0.35549 11.86841 -9.88252 1.98589
magnitude: 2.03774 au
magnitude: 5.17952 debye
