program: Orca
programVersion: 5.0.2
elementType: Cl F F F O O O N N C C C C C C C C C C C C C C C C C C C C C C C C C C H H H H H H H H H H H H H H H H H H H H H H
charge: 0
multiplicity: 1
keywords: wb97x-d3
keywords: def2-TZVPP
keywords: def2/J RIJCOSX
keywords: DEFGRID2
keywords: scfconv7
keywords: smallprint printgap noloewdin
keywords: NOSOSCF
formula: C26H22ClF3N2O3
InChI: InChI=1/C26H22ClF3N2O3/c1-16(2)24(32-22-12-11-18(14-21(22)27)26(28,29)30)25(33)35-23(15-31)17-7-6-10-20(13-17)34-19-8-4-3-5-9-19/h3-14,16,23-24,32H,1-2H3
57 atoms
Cl -0.307287 3.562641 -1.999569
F  -4.173636 1.762357 0.958035
F  -3.332538 -0.003097 1.856808
F  -3.335256 1.8504 2.937559
O  3.350575 -0.483096 0.523365
O  2.58812 0.0612 -1.505797
O  -1.211076 -3.100245 -1.551771
N  1.970534 2.57123 -0.358248
N  4.674235 -3.202778 1.851981
C  4.39404 2.466103 -0.643885
C  3.154861 1.837824 0.015881
C  4.5633 3.909189 -0.184611
C  5.649783 1.656612 -0.340725
C  2.99774 0.387316 -0.425261
C  0.736504 2.252524 0.133721
C  3.11006 -1.865495 0.245951
C  -0.436483 2.663953 -0.520182
C  0.569203 1.530069 1.324636
C  1.655581 -2.204158 0.465507
C  -1.82771 1.655467 1.148138
C  -1.694564 2.374144 -0.030984
C  -0.683665 1.240875 1.82087
C  0.860901 -2.509926 -0.629372
C  1.100797 -2.13126 1.738631
C  -3.163903 1.321585 1.715205
C  -0.492774 -2.752519 -0.446404
C  3.986457 -2.601681 1.156433
C  -0.252898 -2.377254 1.905783
C  -1.058779 -2.68724 0.820114
C  -2.462778 -2.583026 -1.750647
C  -2.771816 -1.258103 -1.466535
C  -3.408229 -3.42868 -2.313478
C  -4.047273 -0.788761 -1.746922
C  -4.675037 -2.941122 -2.598706
C  -5.002491 -1.622888 -2.312435
H  4.230846 2.458195 -1.728013
H  3.295733 1.878414 1.099082
H  4.715115 3.962977 0.895825
H  3.702589 4.530008 -0.432036
H  5.435202 4.356146 -0.663956
H  5.811623 1.558762 0.734733
H  6.523683 2.155985 -0.759847
H  5.625371 0.654598 -0.771886
H  1.985532 2.918804 -1.306279
H  3.415272 -2.119555 -0.77335
H  1.430644 1.197436 1.886276
H  -2.56014 2.713691 -0.583561
H  -0.755632 0.685764 2.74741
H  1.285911 -2.561228 -1.624055
H  1.714008 -1.887686 2.597791
H  -0.689555 -2.332623 2.894596
H  -2.112716 -2.886686 0.967229
H  -2.030494 -0.59107 -1.043096
H  -3.15022 -4.457662 -2.531639
H  -4.291415 0.242446 -1.527724
H  -5.410112 -3.601365 -3.040953
H  -5.993158 -1.247248 -2.531615
elementType: Cl F O N C H
totalener: -2099.13323250 hartree
nucrepener: 4043.28543119 hartree
electener: -6142.41866369 hartree
twoeener: 4778.15145007 hartree
cpcmener: -0.03637419 hartree
kineticenergy: 2091.79946307 hartree
xcener: -173.909537968247 hartree
chargesum: 0.0000000
charge: -0.094653 -0.185015 -0.186586 -0.186399 -0.255576 -0.418709 -0.328957 -0.232416 -0.083602 0.072906 0.108892 -0.292589 -0.301518 0.302259 0.189993 0.397786 0.003391 -0.206974 0.049421 -0.080347 -0.112588 -0.210623 -0.212341 -0.253127 0.577429 0.269473 -0.229738 -0.133288 -0.180307 0.274957 -0.178719 -0.233321 -0.155591 -0.130553 -0.179236 0.060175 0.115542 0.087656 0.092216 0.096403 0.095394 0.094546 0.094361 0.150191 0.141117 0.146310 0.127355 0.149613 0.132600 0.145543 0.161428 0.156093 0.157850 0.144583 0.152389 0.157357 0.157540
qa: -0.0947 -0.1850 -0.1866 -0.1864 -0.2556 -0.4187 -0.3290 -0.2324 -0.0836 0.0729 0.1089 -0.2926 -0.3015 0.3023 0.1900 0.3978 0.0034 -0.2070 0.0494 -0.0803 -0.1126 -0.2106 -0.2123 -0.2531 0.5774 0.2695 -0.2297 -0.1333 -0.1803 0.2750 -0.1787 -0.2333 -0.1556 -0.1306 -0.1792 0.0602 0.1155 0.0877 0.0922 0.0964 0.0954 0.0945 0.0944 0.1502 0.1411 0.1463 0.1274 0.1496 0.1326 0.1455 0.1614 0.1561 0.1578 0.1446 0.1524 0.1574 0.1575
va: 1.2358 1.1159 1.0994 1.1073 2.1409 2.0967 2.0781 3.2013 3.1122 3.8049 3.8540 3.9364 3.9458 4.1731 3.8630 3.7467 3.9198 3.8682 3.5587 3.6267 3.9660 4.0451 4.0734 3.9442 4.3889 3.7555 4.0739 3.8549 3.9058 3.7238 3.8760 3.9915 3.8987 3.8997 3.9202 1.0269 1.0128 1.0016 1.0186 1.0051 1.0036 1.0036 1.0098 1.0484 1.0159 1.0082 1.0256 1.0069 1.0264 1.0098 0.9906 0.9983 0.9873 1.0085 1.0004 0.9890 0.9908
dispcorr: -0.037219620 hartree
energy: -2099.170452119729
dipole: 31.90390 -31.25241 0.65149 -2.20526 3.38650 1.18125 -7.11112 6.86430 -0.24682
magnitude: 1.37139 au
magnitude: 3.48579 debye
