program: Orca
programVersion: 5.0.2
elementType: Cl F F F O O O N N C C C C C C C C C C C C C C C C C C C C C C C C C C H H H H H H H H H H H H H H H H H H H H H H
charge: 0
multiplicity: 1
keywords: wb97x-d3
keywords: def2-TZVPP
keywords: def2/J RIJCOSX
keywords: DEFGRID2
keywords: scfconv7
keywords: smallprint printgap noloewdin
keywords: NOSOSCF
formula: C26H22ClF3N2O3
InChI: InChI=1/C26H22ClF3N2O3/c1-16(2)24(32-22-12-11-18(14-21(22)27)26(28,29)30)25(33)35-23(15-31)17-7-6-10-20(13-17)34-19-8-4-3-5-9-19/h3-14,16,23-24,32H,1-2H3
57 atoms
Cl -0.560142 1.542194 -2.318441
F  -2.966208 0.503322 2.942664
F  -3.060118 2.627383 3.23607
F  -4.05087 1.732556 1.551719
O  2.561897 -0.355048 0.091005
O  3.761495 0.482694 1.776749
O  -1.244705 -2.758775 -2.300848
N  1.866801 2.112862 -0.69458
N  0.930557 -1.271665 2.900192
C  4.261312 1.959213 -1.154736
C  3.157677 1.926128 -0.078819
C  4.250611 3.303259 -1.875338
C  5.638323 1.690032 -0.558104
C  3.215787 0.627411 0.717076
C  0.70869 2.032758 0.026332
C  2.411912 -1.596051 0.765528
C  -0.521391 1.765707 -0.597158
C  0.678601 2.223961 1.4154
C  1.734034 -2.548377 -0.184859
C  -1.697289 1.841116 1.488377
C  -1.701368 1.663894 0.111071
C  -0.497438 2.123637 2.130093
C  0.525677 -2.183895 -0.76924
C  2.327409 -3.766708 -0.47639
C  -2.940978 1.680312 2.294504
C  -0.090497 -3.063627 -1.645664
C  1.590859 -1.40448 1.969804
C  1.701508 -4.633172 -1.3626
C  0.49336 -4.290494 -1.944035
C  -2.258848 -2.073286 -1.687702
C  -2.594187 -2.258972 -0.351809
C  -3.005734 -1.225444 -2.49354
C  -3.688414 -1.583476 0.170471
C  -4.106523 -0.570944 -1.961543
C  -4.4531 -0.744505 -0.628709
H  4.039935 1.170198 -1.882767
H  3.359621 2.732209 0.6330
H  4.454155 4.121871 -1.18161
H  3.300784 3.510271 -2.367809
H  5.024912 3.319927 -2.643412
H  5.869681 2.390752 0.246576
H  6.402002 1.810112 -1.327226
H  5.744014 0.677871 -0.166319
H  1.808706 1.772746 -1.643838
H  3.380025 -1.99721 1.079434
H  1.584818 2.464465 1.954283
H  -2.613964 1.441645 -0.425716
H  -0.460822 2.274017 3.201415
H  0.072697 -1.225738 -0.540799
H  3.270685 -4.038022 -0.019925
H  2.156838 -5.585846 -1.598442
H  0.002019 -4.965855 -2.633137
H  -2.023993 -2.927302 0.281274
H  -2.730609 -1.089047 -3.531808
H  -3.950582 -1.73216 1.209694
H  -4.690122 0.084947 -2.594704
H  -5.312597 -0.232309 -0.218037
elementType: Cl F O N C H
totalener: -2099.13251593 hartree
nucrepener: 4131.68023580 hartree
electener: -6230.81275173 hartree
twoeener: 4867.64658548 hartree
cpcmener: -0.03708027 hartree
kineticenergy: 2091.79395441 hartree
xcener: -173.911848830207 hartree
chargesum: -0.0000000
charge: -0.100105 -0.186930 -0.186399 -0.183913 -0.260096 -0.398054 -0.322114 -0.225793 -0.080698 0.051869 0.111280 -0.290309 -0.299690 0.309029 0.153122 0.417177 0.011159 -0.207484 0.005641 -0.054713 -0.132595 -0.195888 -0.195876 -0.197069 0.565701 0.267396 -0.241742 -0.108144 -0.237811 0.320680 -0.179474 -0.285362 -0.155627 -0.099483 -0.191288 0.061371 0.122163 0.089426 0.092444 0.096083 0.095945 0.094359 0.093747 0.150559 0.131750 0.145721 0.153788 0.145734 0.122277 0.146364 0.159359 0.147205 0.151850 0.141985 0.155116 0.154520 0.151836
qa: -0.1001 -0.1869 -0.1864 -0.1839 -0.2601 -0.3981 -0.3221 -0.2258 -0.0807 0.0519 0.1113 -0.2903 -0.2997 0.3090 0.1531 0.4172 0.0112 -0.2075 0.0056 -0.0547 -0.1326 -0.1959 -0.1959 -0.1971 0.5657 0.2674 -0.2417 -0.1081 -0.2378 0.3207 -0.1795 -0.2854 -0.1556 -0.0995 -0.1913 0.0614 0.1222 0.0894 0.0924 0.0961 0.0959 0.0944 0.0937 0.1506 0.1318 0.1457 0.1538 0.1457 0.1223 0.1464 0.1594 0.1472 0.1519 0.1420 0.1551 0.1545 0.1518
va: 1.2269 1.0975 1.1128 1.1150 2.1805 2.1015 2.0921 3.1926 3.0957 3.8270 3.8475 3.9367 3.9473 4.1586 3.8583 3.7539 3.8982 3.9043 3.7300 3.6716 3.9368 4.0472 3.9618 3.9426 4.4114 3.7534 4.0134 3.8959 4.0078 3.6377 3.8763 3.9584 3.8369 3.8277 3.8468 1.0247 1.0055 1.0013 1.0172 1.0050 1.0047 1.0033 1.0085 1.0462 1.0171 1.0132 1.0093 1.0099 1.0259 1.0021 0.9894 1.0059 0.9992 1.0124 0.9998 0.9897 0.9985
dispcorr: -0.039198118 hartree
energy: -2099.171714048464
dipole: 37.10087 -34.73997 2.36090 -3.25398 2.92248 -0.33151 -17.14425 14.74925 -2.39501
magnitude: 3.37932 au
magnitude: 8.58955 debye
