program: Orca
programVersion: 5.0.2
elementType: Cl F F F O O O N N C C C C C C C C C C C C C C C C C C C C C C C C C C H H H H H H H H H H H H H H H H H H H H H H
charge: 0
multiplicity: 1
keywords: wb97x-d3
keywords: def2-TZVPP
keywords: def2/J RIJCOSX
keywords: DEFGRID2
keywords: scfconv7
keywords: smallprint printgap noloewdin
keywords: NOSOSCF
formula: C26H22ClF3N2O3
InChI: InChI=1/C26H22ClF3N2O3/c1-16(2)24(32-22-12-11-18(14-21(22)27)26(28,29)30)25(33)35-23(15-31)17-7-6-10-20(13-17)34-19-8-4-3-5-9-19/h3-14,16,23-24,32H,1-2H3
57 atoms
Cl -0.596679 3.66634 -1.66784
F  -3.150105 0.541662 3.173668
F  -3.983816 2.300285 2.255419
F  -3.984016 0.432423 1.196552
O  3.313408 -0.750391 0.171517
O  1.897028 -0.17712 -1.460306
O  -1.865583 -2.986821 -0.097283
N  1.765305 2.380493 -0.383527
N  4.938327 -3.504802 0.994144
C  4.142775 2.158552 -0.939313
C  2.93841 1.574168 -0.169373
C  5.451079 1.497165 -0.522147
C  3.986505 2.117424 -2.456483
C  2.649755 0.134513 -0.579125
C  0.571008 2.094109 0.211494
C  2.956981 -2.126367 -0.001586
C  -0.635472 2.635112 -0.270575
C  0.474329 1.274085 1.344107
C  1.653505 -2.405466 0.705646
C  -1.917365 1.532403 1.430664
C  -1.852188 2.36053 0.314614
C  -0.742331 0.997632 1.938468
C  0.510944 -2.633342 -0.046288
C  1.581607 -2.326647 2.093455
C  -3.248236 1.202455 2.015295
C  -0.71445 -2.745901 0.597967
C  4.069896 -2.888671 0.564508
C  0.35721 -2.47323 2.722762
C  -0.798675 -2.666075 1.978465
C  -2.247347 -2.17203 -1.12721
C  -3.219967 -2.688209 -1.97641
C  -1.749897 -0.888812 -1.323314
C  -3.68976 -1.919342 -3.029085
C  -2.223129 -0.136975 -2.391327
C  -3.189854 -0.641712 -3.247864
H  4.183688 3.206164 -0.624865
H  3.204585 1.588206 0.890964
H  5.53088 0.470689 -0.884221
H  5.574926 1.484975 0.56177
H  6.293002 2.049613 -0.940933
H  4.008169 1.096854 -2.842594
H  4.814938 2.65366 -2.92079
H  3.070952 2.590247 -2.816446
H  1.711825 2.834155 -1.282604
H  2.888518 -2.387527 -1.061841
H  1.363866 0.845249 1.784841
H  -2.748694 2.791546 -0.113155
H  -0.750253 0.35708 2.809086
H  0.572811 -2.706041 -1.125112
H  2.472667 -2.150847 2.684551
H  0.295432 -2.417212 3.801461
H  -1.761081 -2.757057 2.466245
H  -3.607705 -3.685293 -1.806647
H  -1.004284 -0.463566 -0.664243
H  -4.449149 -2.326872 -3.684118
H  -1.827274 0.858338 -2.548571
H  -3.551618 -0.046185 -4.075676
elementType: Cl F O N C H
totalener: -2099.13155495 hartree
nucrepener: 4136.05380806 hartree
electener: -6235.18536301 hartree
twoeener: 4871.03826614 hartree
cpcmener: -0.03651562 hartree
kineticenergy: 2091.76544527 hartree
xcener: -173.908568650832 hartree
chargesum: 0.0000000
charge: -0.103590 -0.185120 -0.187799 -0.185066 -0.260534 -0.413448 -0.326513 -0.240598 -0.082820 0.042718 0.163509 -0.309528 -0.292199 0.282900 0.195199 0.398051 0.004706 -0.177747 0.050748 -0.035558 -0.198668 -0.196244 -0.210183 -0.237429 0.566104 0.307085 -0.226579 -0.124945 -0.229494 0.316434 -0.251338 -0.161141 -0.120595 -0.159660 -0.196233 0.064411 0.125876 0.084033 0.100147 0.100696 0.087845 0.103161 0.091138 0.157374 0.139597 0.144174 0.124160 0.158137 0.145348 0.142560 0.160167 0.146048 0.142899 0.096782 0.156631 0.158755 0.155636
qa: -0.1036 -0.1851 -0.1878 -0.1851 -0.2605 -0.4134 -0.3265 -0.2406 -0.0828 0.0427 0.1635 -0.3095 -0.2922 0.2829 0.1952 0.3981 0.0047 -0.1777 0.0507 -0.0356 -0.1987 -0.1962 -0.2102 -0.2374 0.5661 0.3071 -0.2266 -0.1249 -0.2295 0.3164 -0.2513 -0.1611 -0.1206 -0.1597 -0.1962 0.0644 0.1259 0.0840 0.1001 0.1007 0.0878 0.1032 0.0911 0.1574 0.1396 0.1442 0.1242 0.1581 0.1453 0.1426 0.1602 0.1460 0.1429 0.0968 0.1566 0.1588 0.1556
va: 1.2163 1.1157 1.1084 1.0996 2.1585 2.0809 2.0931 3.2266 3.1110 3.8526 3.8404 3.9484 3.9410 4.1566 3.8740 3.7658 3.8313 3.8732 3.5249 3.5749 4.0754 3.9632 3.9634 3.9381 4.4104 3.6674 4.0645 3.8508 3.9800 3.7113 3.9774 3.8205 3.8969 3.8948 3.9391 1.0177 1.0098 1.0086 1.0049 1.0025 1.0087 1.0024 1.0108 1.0449 1.0162 1.0097 1.0285 1.0064 1.0131 1.0105 0.9888 1.0067 1.0102 1.0130 0.9884 0.9932 0.9914
dispcorr: -0.040414831 hartree
energy: -2099.171969775925
dipole: 35.75141 -34.42894 1.32247 -4.63716 5.87627 1.23911 -16.02704 15.62055 -0.40649
magnitude: 1.85730 au
magnitude: 4.72087 debye
