program: Orca
programVersion: 5.0.2
elementType: Cl F F F O O O N N C C C C C C C C C C C C C C C C C C C C C C C C C C H H H H H H H H H H H H H H H H H H H H H H
charge: 0
multiplicity: 1
keywords: wb97x-d3
keywords: def2-TZVPP
keywords: def2/J RIJCOSX
keywords: DEFGRID2
keywords: scfconv7
keywords: smallprint printgap noloewdin
keywords: NOSOSCF
formula: C26H22ClF3N2O3
InChI: InChI=1/C26H22ClF3N2O3/c1-16(2)24(32-22-12-11-18(14-21(22)27)26(28,29)30)25(33)35-23(15-31)17-7-6-10-20(13-17)34-19-8-4-3-5-9-19/h3-14,16,23-24,32H,1-2H3
57 atoms
Cl -0.631119 1.534021 -2.369379
F  -3.408613 0.767999 2.821109
F  -3.099531 2.868683 3.10727
F  -4.181592 2.167223 1.382634
O  2.677281 -0.435017 1.015647
O  4.100878 -0.573544 -0.696729
O  -1.059215 -2.150488 -2.14148
N  1.7864 1.685053 -0.668219
N  1.289727 -2.369094 3.288102
C  4.150259 2.303778 -0.980354
C  3.116264 1.580157 -0.11248
C  3.7306 3.749203 -1.222197
C  5.524433 2.265004 -0.318515
C  3.40229 0.087932 0.019796
C  0.619805 1.713659 0.030566
C  2.629454 -1.853653 1.105269
C  -0.617848 1.664135 -0.638072
C  0.561833 1.816157 1.430193
C  1.945425 -2.497586 -0.078302
C  -1.848819 1.838662 1.410735
C  -1.825583 1.725896 0.027625
C  -0.641078 1.877787 2.099708
C  0.726815 -1.999673 -0.524519
C  2.544503 -3.579603 -0.705579
C  -3.13067 1.909536 2.168557
C  0.103959 -2.612711 -1.602884
C  1.878888 -2.125276 2.332977
C  1.912207 -4.177572 -1.785152
C  0.691732 -3.701805 -2.234279
C  -2.141921 -1.809632 -1.383067
C  -3.109012 -1.04732 -2.029413
C  -2.337607 -2.229888 -0.07331
C  -4.270355 -0.700228 -1.358603
C  -3.501702 -1.861205 0.589158
C  -4.471296 -1.096506 -0.042308
H  4.209726 1.794261 -1.948022
H  3.133079 2.03642 0.880244
H  4.489728 4.265229 -1.811689
H  3.618933 4.2930 -0.281015
H  2.789453 3.826998 -1.766028
H  5.897708 1.253627 -0.161399
H  5.504846 2.768068 0.651157
H  6.256235 2.782411 -0.940097
H  1.726078 1.520659 -1.662329
H  3.633819 -2.270783 1.233944
H  1.469126 1.851809 2.014519
H  -2.73961 1.690978 -0.549295
H  -0.620553 1.958701 3.178982
H  0.266783 -1.148842 -0.034862
H  3.499407 -3.951418 -0.356786
H  2.373475 -5.020302 -2.282612
H  0.195323 -4.164935 -3.077681
H  -2.950831 -0.736167 -3.054077
H  -1.607843 -2.842896 0.438993
H  -5.019668 -0.109422 -1.869865
H  -3.64881 -2.191517 1.609242
H  -5.377366 -0.820396 0.480335
elementType: Cl F O N C H
totalener: -2099.12914736 hartree
nucrepener: 4139.46543601 hartree
electener: -6238.59458337 hartree
twoeener: 4875.13305012 hartree
cpcmener: -0.03678149 hartree
kineticenergy: 2091.78270460 hartree
xcener: -173.913551781484 hartree
chargesum: 0.0000000
charge: -0.102056 -0.187653 -0.188131 -0.186718 -0.270694 -0.404822 -0.315573 -0.168693 -0.085296 0.083105 0.077305 -0.292736 -0.301114 0.329572 0.149008 0.374598 0.022997 -0.234794 0.050133 -0.080773 -0.143457 -0.154689 -0.246575 -0.201425 0.575195 0.288359 -0.227889 -0.103523 -0.237874 0.338464 -0.279060 -0.184580 -0.125534 -0.184039 -0.174046 0.049768 0.122054 0.097887 0.087068 0.087931 0.096638 0.088570 0.094836 0.153674 0.147109 0.132123 0.139482 0.145610 0.143229 0.143440 0.158704 0.146296 0.137082 0.154959 0.155361 0.156794 0.154393
qa: -0.1021 -0.1877 -0.1881 -0.1867 -0.2707 -0.4048 -0.3156 -0.1687 -0.0853 0.0831 0.0773 -0.2927 -0.3011 0.3296 0.1490 0.3746 0.0230 -0.2348 0.0501 -0.0808 -0.1435 -0.1547 -0.2466 -0.2014 0.5752 0.2884 -0.2279 -0.1035 -0.2379 0.3385 -0.2791 -0.1846 -0.1255 -0.1840 -0.1740 0.0498 0.1221 0.0979 0.0871 0.0879 0.0966 0.0886 0.0948 0.1537 0.1471 0.1321 0.1395 0.1456 0.1432 0.1434 0.1587 0.1463 0.1371 0.1550 0.1554 0.1568 0.1544
va: 1.2309 1.0953 1.1090 1.1134 2.1424 2.0992 2.0869 3.1419 3.1033 3.8315 3.8535 3.9415 3.9412 4.2053 3.8447 3.7722 3.8213 3.9213 3.5651 3.6463 3.9632 4.0633 3.9722 3.9696 4.4067 3.7132 4.0733 3.8833 4.0245 3.5995 3.9289 3.8571 3.8424 3.8742 3.8393 1.0292 1.0116 1.0046 1.0029 1.0190 1.0164 1.0021 1.0031 1.0483 1.0105 1.0185 1.0222 1.0078 1.0101 1.0027 0.9890 1.0060 1.0191 0.9978 0.9899 0.9936 0.9930
dispcorr: -0.039651796 hartree
energy: -2099.168799155836
dipole: 36.13779 -33.79514 2.34266 -1.32332 1.71755 0.39423 -12.55369 11.37434 -1.17935
magnitude: 2.65223 au
magnitude: 6.74143 debye
