program: Orca
programVersion: 5.0.2
elementType: Cl F F F O O O N N C C C C C C C C C C C C C C C C C C C C C C C C C C H H H H H H H H H H H H H H H H H H H H H H
charge: 0
multiplicity: 1
keywords: wb97x-d3
keywords: def2-TZVPP
keywords: def2/J RIJCOSX
keywords: DEFGRID2
keywords: scfconv7
keywords: smallprint printgap noloewdin
keywords: NOSOSCF
formula: C26H22ClF3N2O3
InChI: InChI=1/C26H22ClF3N2O3/c1-16(2)24(32-22-12-11-18(14-21(22)27)26(28,29)30)25(33)35-23(15-31)17-7-6-10-20(13-17)34-19-8-4-3-5-9-19/h3-14,16,23-24,32H,1-2H3
57 atoms
Cl -0.42947 1.962343 -2.639688
F  -4.238906 1.450308 0.809139
F  -3.346708 0.450235 2.495344
F  -3.482295 2.591102 2.465757
O  3.255222 -0.503883 0.883969
O  3.674149 -0.424491 -1.308132
O  -1.560997 -1.97425 0.45347
N  1.865981 1.877135 -0.765575
N  3.456315 -2.722485 3.317696
C  4.246809 2.461605 -0.824576
C  3.14909 1.630983 -0.151277
C  3.921689 3.946662 -0.720349
C  5.601426 2.163736 -0.191698
C  3.41999 0.1364 -0.27696
C  0.653904 1.753265 -0.15774
C  3.26879 -1.928628 0.836685
C  -0.53119 1.805359 -0.91302
C  0.499157 1.607587 1.230805
C  2.012647 -2.485013 0.208348
C  -1.902419 1.59184 1.037414
C  -1.781892 1.73046 -0.336536
C  -0.748494 1.530434 1.811764
C  0.776742 -1.979844 0.593707
C  2.098518 -3.481398 -0.751501
C  -3.238036 1.519481 1.691478
C  -0.375147 -2.480119 0.010054
C  3.373109 -2.353495 2.233271
C  0.933715 -3.988486 -1.311548
C  -0.305742 -3.496847 -0.937123
C  -2.566851 -1.683101 -0.426786
C  -2.326928 -1.215196 -1.713046
C  -3.863934 -1.810322 0.049907
C  -3.40304 -0.873003 -2.519496
C  -4.928333 -1.45238 -0.763646
C  -4.705405 -0.985505 -2.051752
H  4.286314 2.184004 -1.883681
H  3.114505 1.913186 0.901612
H  3.844282 4.261729 0.322923
H  2.985576 4.202313 -1.216047
H  4.709768 4.539698 -1.186518
H  6.379219 2.765807 -0.662477
H  5.900566 1.119675 -0.300411
H  5.600364 2.402894 0.874068
H  1.87378 1.850993 -1.775022
H  4.155147 -2.297228 0.310428
H  1.365641 1.546756 1.873361
H  -2.652553 1.780452 -0.975272
H  -0.80746 1.416531 2.887006
H  0.696701 -1.202694 1.344373
H  3.06392 -3.862943 -1.058386
H  0.990768 -4.774976 -2.052351
H  -1.206116 -3.903257 -1.380198
H  -1.317716 -1.100208 -2.086958
H  -4.035858 -2.176349 1.054322
H  -3.215115 -0.505124 -3.520083
H  -5.938312 -1.54357 -0.385107
H  -5.538572 -0.709282 -2.684406
elementType: Cl F O N C H
totalener: -2099.13054591 hartree
nucrepener: 4126.89247928 hartree
electener: -6226.02302518 hartree
twoeener: 4862.41979667 hartree
cpcmener: -0.03642961 hartree
kineticenergy: 2091.80952083 hartree
xcener: -173.916163409295 hartree
chargesum: -0.0000000
charge: -0.099993 -0.183735 -0.191324 -0.188851 -0.264086 -0.419353 -0.323668 -0.184476 -0.083899 0.071073 0.082409 -0.295590 -0.296017 0.314402 0.225891 0.388804 -0.051814 -0.266720 0.040995 -0.103589 -0.075740 -0.155356 -0.280084 -0.189158 0.577823 0.249890 -0.228738 -0.120513 -0.184218 0.301331 -0.165268 -0.258030 -0.188179 -0.126653 -0.158811 0.055527 0.113524 0.086569 0.091210 0.098661 0.095613 0.096619 0.092067 0.153285 0.145253 0.139298 0.131135 0.143963 0.171661 0.144507 0.160199 0.155523 0.150595 0.140158 0.153327 0.155672 0.156882
qa: -0.1000 -0.1837 -0.1913 -0.1889 -0.2641 -0.4194 -0.3237 -0.1845 -0.0839 0.0711 0.0824 -0.2956 -0.2960 0.3144 0.2259 0.3888 -0.0518 -0.2667 0.0410 -0.1036 -0.0757 -0.1554 -0.2801 -0.1892 0.5778 0.2499 -0.2287 -0.1205 -0.1842 0.3013 -0.1653 -0.2580 -0.1882 -0.1267 -0.1588 0.0555 0.1135 0.0866 0.0912 0.0987 0.0956 0.0966 0.0921 0.1533 0.1453 0.1393 0.1311 0.1440 0.1717 0.1445 0.1602 0.1555 0.1506 0.1402 0.1533 0.1557 0.1569
va: 1.2342 1.1137 1.0969 1.1041 2.1361 2.0871 2.0481 3.1714 3.1112 3.8181 3.8739 3.9386 3.9473 4.1884 3.7844 3.7460 3.8504 3.8924 3.6120 3.6005 3.8889 4.0474 4.0148 3.9762 4.3951 3.8161 4.0857 3.8942 3.9371 3.5640 3.7981 3.9563 3.9098 3.8687 3.8918 1.0315 1.0176 1.0023 1.0188 1.0042 1.0030 1.0113 1.0029 1.0508 1.0139 1.0133 1.0233 1.0082 1.0010 1.0030 0.9900 0.9965 1.0022 1.0156 0.9964 0.9894 0.9895
dispcorr: -0.039580777 hartree
energy: -2099.170126682332
dipole: 33.73590 -32.25749 1.47840 0.42883 0.13940 0.56823 -12.28803 10.44870 -1.83933
magnitude: 2.42728 au
magnitude: 6.16965 debye
