program: Orca
programVersion: 5.0.2
elementType: Cl F F F O O O N N C C C C C C C C C C C C C C C C C C C C C C C C C C H H H H H H H H H H H H H H H H H H H H H H
charge: 0
multiplicity: 1
keywords: wb97x-d3
keywords: def2-TZVPP
keywords: def2/J RIJCOSX
keywords: DEFGRID2
keywords: scfconv7
keywords: smallprint printgap noloewdin
keywords: NOSOSCF
formula: C26H22ClF3N2O3
InChI: InChI=1/C26H22ClF3N2O3/c1-16(2)24(32-22-12-11-18(14-21(22)27)26(28,29)30)25(33)35-23(15-31)17-7-6-10-20(13-17)34-19-8-4-3-5-9-19/h3-14,16,23-24,32H,1-2H3
57 atoms
Cl 0.345742 3.12249 -2.121282
F  -3.417057 0.092465 1.497476
F  -3.422385 1.985776 2.496892
F  -3.987683 1.870523 0.424252
O  3.122833 -0.198575 -0.518941
O  3.730869 -0.416246 1.618764
O  -1.944818 -1.226266 -1.093467
N  2.306485 2.33427 -0.028011
N  4.69828 -3.205292 0.161725
C  4.748885 2.41954 0.230712
C  3.417827 1.803438 0.713413
C  5.89051 2.061073 1.174586
C  5.122682 2.080144 -1.20885
C  3.448017 0.281596 0.683069
C  1.009539 2.060049 0.285225
C  2.819641 -1.583212 -0.651989
C  -0.037063 2.396282 -0.59107
C  0.635232 1.463135 1.500662
C  1.462138 -1.881772 -0.064463
C  -1.70386 1.612093 0.940958
C  -1.363578 2.180359 -0.278317
C  -0.689571 1.247931 1.819456
C  0.359079 -1.49584 -0.818357
C  1.286288 -2.457056 1.185757
C  -3.126032 1.392927 1.32951
C  -0.919451 -1.67723 -0.317575
C  3.884474 -2.456247 -0.147721
C  -0.000803 -2.632611 1.675692
C  -1.107141 -2.240208 0.940562
C  -3.119418 -1.916468 -1.203123
C  -4.25098 -1.160743 -1.482474
C  -3.200265 -3.300644 -1.112916
C  -5.471617 -1.793883 -1.656236
C  -4.432805 -3.918807 -1.27678
C  -5.572477 -3.174175 -1.54442
H  4.585579 3.499892 0.295959
H  3.315255 2.077799 1.767069
H  6.783082 2.629022 0.910051
H  6.155684 1.003676 1.119285
H  5.648634 2.294244 2.212568
H  5.407113 1.032917 -1.322453
H  5.983194 2.67973 -1.508255
H  4.331526 2.291391 -1.930699
H  2.494229 2.615153 -0.977656
H  2.789456 -1.745458 -1.731739
H  1.383687 1.176498 2.226069
H  -2.120131 2.468014 -0.99557
H  -0.919347 0.792393 2.774465
H  0.490291 -1.051324 -1.798299
H  2.132052 -2.775391 1.780583
H  -0.144959 -3.075924 2.652047
H  -2.099349 -2.381612 1.347495
H  -4.171961 -0.084854 -1.569222
H  -2.321473 -3.902741 -0.920725
H  -6.350181 -1.199519 -1.87176
H  -4.49436 -4.996758 -1.199812
H  -6.528572 -3.664688 -1.670625
elementType: Cl F O N C H
totalener: -2099.12947872 hartree
nucrepener: 4102.29750871 hartree
electener: -6201.42698743 hartree
twoeener: 4837.83000489 hartree
cpcmener: -0.03723924 hartree
kineticenergy: 2091.79468250 hartree
xcener: -173.916698212149 hartree
chargesum: -0.0000000
charge: -0.099271 -0.183418 -0.186536 -0.186717 -0.260762 -0.400557 -0.319355 -0.228107 -0.079296 0.048059 0.136218 -0.310514 -0.290253 0.298466 0.171035 0.410817 -0.008066 -0.185070 0.039157 -0.067646 -0.102474 -0.226406 -0.331878 -0.162787 0.579164 0.347524 -0.240223 -0.135520 -0.224499 0.335427 -0.281820 -0.221203 -0.110928 -0.147339 -0.191931 0.064778 0.134554 0.099966 0.087842 0.100699 0.085421 0.103768 0.089948 0.157956 0.139244 0.135592 0.125858 0.145996 0.126627 0.139509 0.160223 0.151330 0.140689 0.155085 0.156938 0.158077 0.156608
qa: -0.0993 -0.1834 -0.1865 -0.1867 -0.2608 -0.4006 -0.3194 -0.2281 -0.0793 0.0481 0.1362 -0.3105 -0.2903 0.2985 0.1710 0.4108 -0.0081 -0.1851 0.0392 -0.0676 -0.1025 -0.2264 -0.3319 -0.1628 0.5792 0.3475 -0.2402 -0.1355 -0.2245 0.3354 -0.2818 -0.2212 -0.1109 -0.1473 -0.1919 0.0648 0.1346 0.1000 0.0878 0.1007 0.0854 0.1038 0.0899 0.1580 0.1392 0.1356 0.1259 0.1460 0.1266 0.1395 0.1602 0.1513 0.1407 0.1551 0.1569 0.1581 0.1566
va: 1.2294 1.0972 1.1090 1.1127 2.1468 2.1012 2.0314 3.2129 3.1071 3.8625 3.8616 3.9402 3.9470 4.1354 3.8528 3.9046 3.8870 3.8402 3.5840 3.5878 3.9710 4.0610 4.1061 3.9266 4.3803 3.5227 4.0453 3.9471 3.9322 3.6504 3.9893 3.9172 3.8944 3.8994 3.9183 1.0179 1.0047 1.0015 1.0072 1.0046 1.0104 1.0033 1.0107 1.0444 0.9961 1.0195 1.0250 1.0109 1.0239 1.0193 0.9904 1.0081 1.0182 0.9992 0.9902 0.9907 0.9909
dispcorr: -0.039304634 hartree
energy: -2099.168783357314
dipole: 30.81770 -30.71091 0.10679 -8.68524 9.68292 0.99769 -2.02078 1.16693 -0.85384
magnitude: 1.31751 au
magnitude: 3.34884 debye
