program: Orca
programVersion: 5.0.2
elementType: Cl F F F O O O N N C C C C C C C C C C C C C C C C C C C C C C C C C C H H H H H H H H H H H H H H H H H H H H H H
charge: 0
multiplicity: 1
keywords: wb97x-d3
keywords: def2-TZVPP
keywords: def2/J RIJCOSX
keywords: DEFGRID2
keywords: scfconv7
keywords: smallprint printgap noloewdin
keywords: NOSOSCF
formula: C26H22ClF3N2O3
InChI: InChI=1/C26H22ClF3N2O3/c1-16(2)24(32-22-12-11-18(14-21(22)27)26(28,29)30)25(33)35-23(15-31)17-7-6-10-20(13-17)34-19-8-4-3-5-9-19/h3-14,16,23-24,32H,1-2H3
57 atoms
Cl -0.113306 1.758206 -2.473071
F  -2.890518 -0.06118 2.459831
F  -3.223695 2.031547 2.795357
F  -3.908193 1.114162 0.972238
O  2.781849 -0.156467 0.105615
O  4.475291 0.438976 1.429402
O  -1.954976 -2.011653 0.192246
N  2.105539 2.280322 -0.560161
N  2.721878 -1.812707 3.120145
C  4.508018 2.593741 -0.830363
C  3.369175 2.141706 0.112951
C  5.782876 2.936861 -0.072417
C  4.788428 1.593717 -1.949237
C  3.624922 0.730821 0.631996
C  0.909611 1.998739 0.0300
C  2.841865 -1.513467 0.523446
C  -0.238102 1.751456 -0.740217
C  0.750347 1.954215 1.423699
C  1.644625 -2.201514 -0.082683
C  -1.594245 1.450831 1.208586
C  -1.466522 1.487061 -0.171755
C  -0.473545 1.683835 1.998736
C  0.369821 -1.785351 0.285434
C  1.812372 -3.21189 -1.015979
C  -2.90045 1.135543 1.85002
C  -0.736122 -2.400926 -0.274084
C  2.795208 -1.636721 1.987187
C  0.692367 -3.816371 -1.573795
C  -0.583182 -3.422251 -1.207285
C  -3.018416 -1.840554 -0.648313
C  -2.884764 -1.326588 -1.932317
C  -4.271858 -2.137825 -0.130565
C  -4.023977 -1.112505 -2.696102
C  -5.400651 -1.910014 -0.902822
C  -5.28368 -1.399908 -2.188899
H  4.135708 3.519264 -1.280129
H  3.394358 2.796295 0.989884
H  6.26158 2.05766 0.358646
H  5.591429 3.646494 0.734004
H  6.502966 3.39747 -0.750104
H  5.244729 0.677193 -1.568114
H  5.489266 2.024738 -2.664874
H  3.896244 1.312626 -2.512431
H  2.13903 2.154773 -1.560279
H  3.771589 -1.978326 0.181449
H  1.59399 2.137607 2.075553
H  -2.31309 1.306225 -0.81973
H  -0.540416 1.657823 3.079095
H  0.224894 -0.996087 1.015089
H  2.805629 -3.530024 -1.305692
H  0.814781 -4.611085 -2.297591
H  -1.446973 -3.9141 -1.636654
H  -1.910838 -1.079152 -2.335961
H  -4.360378 -2.535515 0.872698
H  -3.920429 -0.709249 -3.695259
H  -6.377055 -2.136866 -0.494376
H  -6.166649 -1.224932 -2.789266
elementType: Cl F O N C H
totalener: -2099.13059785 hartree
nucrepener: 4134.48507529 hartree
electener: -6233.61567314 hartree
twoeener: 4870.27506602 hartree
cpcmener: -0.03966505 hartree
kineticenergy: 2091.80658731 hartree
xcener: -173.915974834918 hartree
chargesum: 0.0000000
charge: -0.101616 -0.187851 -0.187317 -0.185528 -0.242852 -0.408713 -0.315572 -0.232461 -0.078043 0.042669 0.110874 -0.302611 -0.288335 0.317304 0.178618 0.384638 0.022545 -0.212600 0.024242 -0.086163 -0.146305 -0.168476 -0.273656 -0.164693 0.578935 0.225373 -0.239857 -0.133057 -0.170078 0.342655 -0.230897 -0.290235 -0.135924 -0.102055 -0.188683 0.061527 0.127715 0.088247 0.094474 0.097894 0.090469 0.103561 0.092245 0.153328 0.138480 0.140946 0.140600 0.143182 0.152004 0.145305 0.160072 0.155225 0.145503 0.143036 0.157779 0.157045 0.157087
qa: -0.1016 -0.1879 -0.1873 -0.1855 -0.2429 -0.4087 -0.3156 -0.2325 -0.0780 0.0427 0.1109 -0.3026 -0.2883 0.3173 0.1786 0.3846 0.0225 -0.2126 0.0242 -0.0862 -0.1463 -0.1685 -0.2737 -0.1647 0.5789 0.2254 -0.2399 -0.1331 -0.1701 0.3427 -0.2309 -0.2902 -0.1359 -0.1021 -0.1887 0.0615 0.1277 0.0882 0.0945 0.0979 0.0905 0.1036 0.0922 0.1533 0.1385 0.1409 0.1406 0.1432 0.1520 0.1453 0.1601 0.1552 0.1455 0.1430 0.1578 0.1570 0.1571
va: 1.2282 1.0980 1.1103 1.1153 2.1708 2.0966 2.0473 3.2009 3.1110 3.8583 3.8654 3.9525 3.9281 4.1623 3.8505 3.7762 3.8679 3.8782 3.6981 3.6023 3.9571 4.0369 4.0100 3.9315 4.4014 3.8548 4.0488 3.9071 3.9314 3.5006 3.8824 4.0181 3.9088 3.8682 3.9162 1.0222 1.0026 1.0102 1.0036 1.0022 1.0083 1.0033 1.0128 1.0465 1.0091 1.0085 1.0100 1.0096 1.0146 1.0017 0.9906 0.9971 1.0109 1.0126 0.9902 0.9889 0.9904
dispcorr: -0.039307459 hartree
energy: -2099.169905310159
dipole: 32.99550 -31.75360 1.24190 -1.66663 1.97479 0.30816 -17.83837 14.53054 -3.30783
magnitude: 3.54669 au
magnitude: 9.01498 debye
