program: Orca
programVersion: 5.0.2
elementType: Cl F F F O O O N N C C C C C C C C C C C C C C C C C C C C C C C C C C H H H H H H H H H H H H H H H H H H H H H H
charge: 0
multiplicity: 1
keywords: wb97x-d3
keywords: def2-TZVPP
keywords: def2/J RIJCOSX
keywords: DEFGRID2
keywords: scfconv7
keywords: smallprint printgap noloewdin
keywords: NOSOSCF
formula: C26H22ClF3N2O3
InChI: InChI=1/C26H22ClF3N2O3/c1-16(2)24(32-22-12-11-18(14-21(22)27)26(28,29)30)25(33)35-23(15-31)17-7-6-10-20(13-17)34-19-8-4-3-5-9-19/h3-14,16,23-24,32H,1-2H3
57 atoms
Cl 1.543373 4.052895 -1.778743
F  -3.381524 2.398871 -2.696659
F  -4.099508 1.426919 -0.914955
F  -3.94853 3.570537 -0.991174
O  2.406118 -0.150481 -0.584084
O  2.082339 -1.191473 1.367309
O  -2.253235 -3.139415 0.238154
N  2.010264 2.247367 0.539553
N  3.357636 -3.456759 -0.680916
C  3.996765 1.424862 1.718818
C  2.511269 1.185134 1.370108
C  4.4588 0.506024 2.843043
C  4.939198 1.323736 0.523471
C  2.302068 -0.187667 0.74529
C  0.720945 2.270182 0.095716
C  2.049193 -1.296736 -1.351639
C  0.340559 3.081894 -0.98808
C  -0.294948 1.514231 0.698158
C  0.550807 -1.462706 -1.412989
C  -1.938763 2.355573 -0.843152
C  -0.954682 3.124891 -1.453442
C  -1.597184 1.556659 0.238473
C  -0.133064 -2.298748 -0.54119
C  -0.143816 -0.692319 -2.339448
C  -3.335295 2.431432 -1.355671
C  -1.521303 -2.333358 -0.581139
C  2.765242 -2.502879 -0.923522
C  -1.52663 -0.762698 -2.388578
C  -2.223295 -1.570472 -1.503911
C  -1.819319 -3.414872 1.508356
C  -1.965272 -4.71979 1.955292
C  -1.307739 -2.429951 2.345669
C  -1.598189 -5.041406 3.254292
C  -0.931759 -2.769541 3.636944
C  -1.074438 -4.071707 4.097955
H  4.025717 2.452847 2.093758
H  1.963184 1.170782 2.316348
H  5.455419 0.799081 3.175201
H  4.519241 -0.536692 2.52718
H  3.79619 0.558663 3.708359
H  5.033086 0.297348 0.16388
H  5.936833 1.651357 0.817825
H  4.643199 1.948117 -0.321641
H  2.690101 2.69064 -0.05907
H  2.422562 -1.068242 -2.352222
H  -0.076804 0.882527 1.548519
H  -1.187847 3.760902 -2.297892
H  -2.337004 0.948718 0.74107
H  0.404959 -2.921237 0.161849
H  0.391537 -0.042933 -3.020983
H  -2.070402 -0.172908 -3.113975
H  -3.304559 -1.618404 -1.532059
H  -2.367241 -5.475188 1.291515
H  -1.202235 -1.407455 2.003757
H  -1.716427 -6.059537 3.602219
H  -0.529241 -2.004161 4.288016
H  -0.781053 -4.327412 5.107584
elementType: Cl F O N C H
totalener: -2099.12951212 hartree
nucrepener: 4093.54300910 hartree
electener: -6192.67252122 hartree
twoeener: 4828.51307922 hartree
cpcmener: -0.03815999 hartree
kineticenergy: 2091.80418625 hartree
xcener: -173.918050835153 hartree
chargesum: -0.0000000
charge: -0.096463 -0.189882 -0.184435 -0.186468 -0.257453 -0.408506 -0.325222 -0.243553 -0.079863 0.051165 0.146842 -0.311394 -0.291067 0.303754 0.176814 0.402666 -0.010035 -0.198093 0.022418 -0.075581 -0.120718 -0.179184 -0.183313 -0.265987 0.569113 0.280117 -0.236885 -0.081489 -0.252182 0.268897 -0.225865 -0.167551 -0.134271 -0.174070 -0.163755 0.064341 0.131519 0.099508 0.086787 0.098806 0.086236 0.103379 0.089184 0.156459 0.141156 0.144820 0.122836 0.150443 0.142106 0.141679 0.151185 0.143820 0.144648 0.152406 0.157676 0.155381 0.157122
qa: -0.0965 -0.1899 -0.1844 -0.1865 -0.2575 -0.4085 -0.3252 -0.2436 -0.0799 0.0512 0.1468 -0.3114 -0.2911 0.3038 0.1768 0.4027 -0.0100 -0.1981 0.0224 -0.0756 -0.1207 -0.1792 -0.1833 -0.2660 0.5691 0.2801 -0.2369 -0.0815 -0.2522 0.2689 -0.2259 -0.1676 -0.1343 -0.1741 -0.1638 0.0643 0.1315 0.0995 0.0868 0.0988 0.0862 0.1034 0.0892 0.1565 0.1412 0.1448 0.1228 0.1504 0.1421 0.1417 0.1512 0.1438 0.1446 0.1524 0.1577 0.1554 0.1571
va: 1.2313 1.1031 1.1146 1.1035 2.1474 2.0873 2.0940 3.2161 3.1037 3.8509 3.8547 3.9467 3.9420 4.1172 3.8436 3.9112 3.9063 3.8750 3.5717 3.6087 4.0853 3.9550 3.9103 3.9602 4.4003 3.7645 4.0532 3.8161 3.9832 3.7032 3.9967 3.8636 3.8943 3.9319 3.8924 1.0184 1.0045 1.0015 1.0091 1.0042 1.0095 1.0037 1.0128 1.0455 0.9958 1.0112 1.0278 1.0065 1.0196 1.0031 1.0032 1.0107 1.0082 0.9898 0.9893 0.9931 0.9903
dispcorr: -0.039410765 hartree
energy: -2099.168922884984
dipole: 32.64480 -31.60638 1.03843 -20.62809 22.25468 1.62659 26.32026 -26.09716 0.22309
magnitude: 1.94266 au
magnitude: 4.93784 debye
