program: Orca
programVersion: 5.0.2
elementType: Cl F F F O O O N N C C C C C C C C C C C C C C C C C C C C C C C C C C H H H H H H H H H H H H H H H H H H H H H H
charge: 0
multiplicity: 1
keywords: wb97x-d3
keywords: def2-TZVPP
keywords: def2/J RIJCOSX
keywords: DEFGRID2
keywords: scfconv7
keywords: smallprint printgap noloewdin
keywords: NOSOSCF
formula: C26H22ClF3N2O3
InChI: InChI=1/C26H22ClF3N2O3/c1-16(2)24(32-22-12-11-18(14-21(22)27)26(28,29)30)25(33)35-23(15-31)17-7-6-10-20(13-17)34-19-8-4-3-5-9-19/h3-14,16,23-24,32H,1-2H3
57 atoms
Cl -0.453177 2.885582 -2.434025
F  -4.525724 4.290978 0.543026
F  -4.935994 2.235048 1.020599
F  -4.189308 3.556302 2.538828
O  3.146857 -1.211516 0.575708
O  2.379198 -0.567492 -1.425149
O  -0.989219 -4.022314 0.148212
N  1.134556 1.597208 -0.291982
N  5.23795 -3.403883 1.853422
C  3.31997 1.742242 0.896232
C  2.094793 0.883287 0.498173
C  4.102811 2.234503 -0.315209
C  2.875214 2.906506 1.771343
C  2.536051 -0.357207 -0.255422
C  -0.09516 2.002003 0.110249
C  3.652113 -2.41553 0.027029
C  -0.970534 2.637468 -0.793773
C  -0.578955 1.833519 1.417637
C  2.573415 -3.41946 -0.328176
C  -2.679964 2.873491 0.869288
C  -2.229123 3.063979 -0.430926
C  -1.841477 2.249145 1.783703
C  1.277975 -3.267037 0.135389
C  2.909708 -4.500501 -1.135382
C  -4.071071 3.243756 1.242095
C  0.305788 -4.175828 -0.262445
C  4.535997 -2.958945 1.061363
C  1.939296 -5.427762 -1.477693
C  0.626103 -5.263525 -1.057674
C  -1.609361 -2.82271 -0.087722
C  -2.582561 -2.427113 0.819956
C  -1.320852 -2.042828 -1.202442
C  -3.280378 -1.247847 0.601381
C  -2.022944 -0.862737 -1.40248
C  -3.00436 -0.460273 -0.507901
H  3.974098 1.10222 1.494845
H  1.624008 0.536287 1.418627
H  4.503873 1.418585 -0.919672
H  4.952475 2.836167 0.009151
H  3.492564 2.866028 -0.96499
H  2.333446 2.56494 2.654718
H  2.231856 3.599953 1.227321
H  3.742734 3.469816 2.116837
H  1.397648 1.790069 -1.24484
H  4.269432 -2.212383 -0.855513
H  0.040501 1.373383 2.173383
H  -2.854123 3.537871 -1.176743
H  -2.158192 2.080931 2.804475
H  1.00074 -2.447538 0.787053
H  3.924198 -4.615479 -1.497705
H  2.199238 -6.272408 -2.102168
H  -0.142481 -5.966605 -1.352791
H  -2.793409 -3.042312 1.686068
H  -0.566341 -2.345744 -1.917611
H  -4.039461 -0.941928 1.310185
H  -1.799463 -0.25711 -2.27153
H  -3.552396 0.456247 -0.675707
elementType: Cl F O N C H
totalener: -2099.13070221 hartree
nucrepener: 3995.88537523 hartree
electener: -6095.01607743 hartree
twoeener: 4730.43640016 hartree
cpcmener: -0.03791366 hartree
kineticenergy: 2091.79197319 hartree
xcener: -173.916254078230 hartree
chargesum: -0.0000000
charge: -0.102202 -0.184905 -0.183961 -0.185025 -0.274985 -0.400116 -0.332075 -0.155829 -0.081774 0.064256 0.106923 -0.299178 -0.314773 0.331387 0.116252 0.369620 -0.040703 -0.164332 0.042647 -0.062854 -0.105870 -0.203366 -0.163507 -0.218937 0.554349 0.209901 -0.227647 -0.120239 -0.203153 0.282375 -0.235796 -0.180545 -0.121435 -0.147209 -0.191343 0.060124 0.123999 0.094598 0.100413 0.081253 0.099265 0.089799 0.106470 0.148033 0.151596 0.138053 0.124482 0.143826 0.151308 0.148115 0.159847 0.149438 0.144729 0.149482 0.150971 0.150575 0.157673
qa: -0.1022 -0.1849 -0.1840 -0.1850 -0.2750 -0.4001 -0.3321 -0.1558 -0.0818 0.0643 0.1069 -0.2992 -0.3148 0.3314 0.1163 0.3696 -0.0407 -0.1643 0.0426 -0.0629 -0.1059 -0.2034 -0.1635 -0.2189 0.5543 0.2099 -0.2276 -0.1202 -0.2032 0.2824 -0.2358 -0.1805 -0.1214 -0.1472 -0.1913 0.0601 0.1240 0.0946 0.1004 0.0813 0.0993 0.0898 0.1065 0.1480 0.1516 0.1381 0.1245 0.1438 0.1513 0.1481 0.1598 0.1494 0.1447 0.1495 0.1510 0.1506 0.1577
va: 1.2256 1.1150 1.0930 1.1143 2.1249 2.0980 2.0779 3.1521 3.1135 3.8021 3.8790 3.9375 3.9310 4.2703 3.8926 3.7508 3.8573 3.8574 3.6056 3.5899 4.0001 4.0426 3.9451 3.9953 4.4229 3.7934 4.0626 3.8923 4.0089 3.6766 4.0168 3.8495 3.8826 3.8680 3.8589 1.0287 1.0250 1.0095 1.0042 1.0124 1.0021 1.0015 1.0058 1.0584 1.0101 1.0073 1.0289 1.0112 1.0071 1.0005 0.9887 1.0026 1.0076 1.0037 0.9974 1.0001 0.9965
dispcorr: -0.037502006 hartree
energy: -2099.168204213675
dipole: 34.25391 -32.83457 1.41934 -13.20087 13.41339 0.21252 1.05253 -1.58109 -0.52856
magnitude: 1.52940 au
magnitude: 3.88744 debye
