program: Orca
programVersion: 5.0.2
elementType: Cl F F F O O O N N C C C C C C C C C C C C C C C C C C C C C C C C C C H H H H H H H H H H H H H H H H H H H H H H
charge: 0
multiplicity: 1
keywords: wb97x-d3
keywords: def2-TZVPP
keywords: def2/J RIJCOSX
keywords: DEFGRID2
keywords: scfconv7
keywords: smallprint printgap noloewdin
keywords: NOSOSCF
formula: C26H22ClF3N2O3
InChI: InChI=1/C26H22ClF3N2O3/c1-16(2)24(32-22-12-11-18(14-21(22)27)26(28,29)30)25(33)35-23(15-31)17-7-6-10-20(13-17)34-19-8-4-3-5-9-19/h3-14,16,23-24,32H,1-2H3
57 atoms
Cl -0.733603 2.108736 -2.294284
F  -2.881056 -0.374626 2.531568
F  -2.864179 1.531809 3.512698
F  -3.98946 1.270076 1.697282
O  2.62111 -0.236713 -0.00113
O  4.38171 0.550017 1.11592
O  -1.988242 -2.508383 0.057278
N  1.780406 2.189278 -0.737235
N  2.506798 -1.267418 3.247199
C  4.110182 2.415837 -1.408134
C  3.13094 2.082824 -0.259024
C  5.517933 2.700151 -0.903576
C  4.132421 1.352955 -2.501946
C  3.46292 0.733198 0.359698
C  0.676388 1.932947 0.01185
C  2.755046 -1.494239 0.650206
C  -0.593159 1.838482 -0.586086
C  0.72686 1.765896 1.404419
C  1.653124 -2.397575 0.16151
C  -1.642978 1.344941 1.510469
C  -1.72912 1.542478 0.137482
C  -0.405458 1.467558 2.133484
C  0.325195 -2.006411 0.299936
C  1.969564 -3.629174 -0.392443
C  -2.840415 0.951258 2.304275
C  -0.673091 -2.866264 -0.11977
C  2.634904 -1.332127 2.105579
C  0.953501 -4.480521 -0.805516
C  -0.373175 -4.102425 -0.674892
C  -2.599635 -1.753184 -0.907173
C  -3.904186 -1.355231 -0.632945
C  -1.988155 -1.395517 -2.101756
C  -4.592927 -0.59117 -1.560503
C  -2.696169 -0.631588 -3.021425
C  -3.994704 -0.223938 -2.760641
H  3.721732 3.344528 -1.836818
H  3.302723 2.814175 0.537929
H  5.516672 3.431832 -0.0948
H  6.12025 3.107454 -1.715943
H  6.022928 1.801516 -0.549572
H  4.73672 1.702267 -3.339382
H  3.143374 1.121666 -2.900499
H  4.579608 0.420634 -2.15075
H  1.664199 2.162561 -1.737921
H  3.7325 -1.939245 0.442517
H  1.662919 1.872167 1.936605
H  -2.674851 1.472498 -0.383808
H  -0.305094 1.333158 3.202544
H  0.062369 -1.050464 0.74082
H  3.005098 -3.927374 -0.494191
H  1.198235 -5.443494 -1.232555
H  -1.170058 -4.76185 -0.993696
H  -4.371905 -1.643853 0.299443
H  -0.974005 -1.695853 -2.329291
H  -5.605978 -0.279826 -1.341574
H  -2.214902 -0.352984 -3.949387
H  -4.535445 0.374076 -3.481772
elementType: Cl F O N C H
totalener: -2099.11860762 hartree
nucrepener: 4171.80505868 hartree
electener: -6270.92366630 hartree
twoeener: 4907.48542050 hartree
cpcmener: -0.04531124 hartree
kineticenergy: 2091.77663993 hartree
xcener: -173.914422675226 hartree
chargesum: -0.0000000
charge: -0.099450 -0.189358 -0.186695 -0.186521 -0.261043 -0.433677 -0.337694 -0.221087 -0.091110 0.055795 0.102430 -0.312163 -0.295738 0.336390 0.212391 0.425266 -0.018561 -0.257316 -0.042360 -0.108420 -0.131599 -0.102126 -0.105293 -0.132989 0.566453 0.134686 -0.240966 -0.153986 -0.129630 0.363448 -0.273899 -0.207821 -0.116625 -0.189196 -0.188201 0.064236 0.135041 0.099764 0.101024 0.085571 0.104156 0.092311 0.090093 0.157417 0.139965 0.138138 0.145258 0.142634 0.093191 0.150411 0.163611 0.154355 0.140148 0.144718 0.157649 0.158694 0.158282
qa: -0.0994 -0.1894 -0.1867 -0.1865 -0.2610 -0.4337 -0.3377 -0.2211 -0.0911 0.0558 0.1024 -0.3122 -0.2957 0.3364 0.2124 0.4253 -0.0186 -0.2573 -0.0424 -0.1084 -0.1316 -0.1021 -0.1053 -0.1330 0.5665 0.1347 -0.2410 -0.1540 -0.1296 0.3634 -0.2739 -0.2078 -0.1166 -0.1892 -0.1882 0.0642 0.1350 0.0998 0.1010 0.0856 0.1042 0.0923 0.0901 0.1574 0.1400 0.1381 0.1453 0.1426 0.0932 0.1504 0.1636 0.1544 0.1401 0.1447 0.1576 0.1587 0.1583
va: 1.2293 1.0912 1.1121 1.1139 2.1735 2.0681 2.0560 3.2062 3.1026 3.8424 3.8665 3.9500 3.9333 4.1209 3.8344 3.7215 3.9033 3.9008 3.7499 3.6433 3.9548 3.9562 3.9296 3.8876 4.4192 3.8680 4.0360 3.9080 3.9547 3.5420 3.9341 3.8111 3.8717 3.8607 3.8941 1.0189 1.0045 1.0031 1.0019 1.0086 1.0028 1.0140 1.0086 1.0422 1.0157 1.0156 1.0092 1.0115 1.0487 0.9997 0.9887 0.9981 1.0211 1.0086 0.9891 0.9947 0.9896
dispcorr: -0.040710979 hartree
energy: -2099.159318598661
dipole: 34.92864 -33.10124 1.82740 -1.64352 1.67393 0.03041 -24.35474 20.76825 -3.58650
magnitude: 4.02533 au
magnitude: 10.23157 debye
