program: Orca
programVersion: 5.0.2
elementType: Cl F F F O O O N N C C C C C C C C C C C C C C C C C C C C C C C C C C H H H H H H H H H H H H H H H H H H H H H H
charge: 0
multiplicity: 1
keywords: wb97x-d3
keywords: def2-TZVPP
keywords: def2/J RIJCOSX
keywords: DEFGRID2
keywords: scfconv7
keywords: smallprint printgap noloewdin
keywords: NOSOSCF
formula: C26H22ClF3N2O3
InChI: InChI=1/C26H22ClF3N2O3/c1-16(2)24(32-22-12-11-18(14-21(22)27)26(28,29)30)25(33)35-23(15-31)17-7-6-10-20(13-17)34-19-8-4-3-5-9-19/h3-14,16,23-24,32H,1-2H3
57 atoms
Cl -0.569621 2.12341 -2.25308
F  -3.988215 1.046826 1.516811
F  -2.843195 0.35921 3.205399
F  -3.264894 2.449451 2.975321
O  2.739698 -0.503954 -0.751504
O  3.619155 -0.269419 1.289199
O  -2.379401 -1.564798 0.112188
N  1.897738 2.087323 -0.580342
N  4.55941 -3.263872 0.169884
C  4.303531 2.087981 -1.035975
C  3.183977 1.705636 -0.052193
C  4.347891 3.600336 -1.216156
C  5.65482 1.568573 -0.558866
C  3.219277 0.218152 0.265465
C  0.740443 1.870144 0.109357
C  2.45558 -1.881621 -0.534249
C  -0.508858 1.893767 -0.533652
C  0.726103 1.644334 1.494235
C  1.250519 -2.063291 0.358872
C  -1.676582 1.502635 1.520524
C  -1.694218 1.726988 0.150838
C  -0.455153 1.460542 2.181735
C  0.016566 -1.720418 -0.187734
C  1.338905 -2.523098 1.664507
C  -2.938687 1.337596 2.293365
C  -1.133516 -1.879976 0.570014
C  3.641557 -2.623007 -0.094792
C  0.180584 -2.651368 2.419319
C  -1.05481 -2.338939 1.879865
C  -2.726396 -1.711513 -1.206108
C  -2.259501 -2.75148 -2.001295
C  -3.64686 -0.799828 -1.70561
C  -2.707002 -2.854248 -3.311566
C  -4.09371 -0.923221 -3.012761
C  -3.621254 -1.944519 -3.825146
H  4.074734 1.625636 -2.002406
H  3.375579 2.228604 0.888729
H  4.546884 4.10035 -0.266033
H  3.41863 4.000558 -1.619817
H  5.146364 3.871228 -1.907315
H  5.88039 1.91831 0.450429
H  6.443939 1.931063 -1.217476
H  5.716822 0.479383 -0.561963
H  1.829044 2.052238 -1.587367
H  2.22171 -2.263824 -1.530462
H  1.6497 1.623794 2.054574
H  -2.623693 1.769088 -0.399985
H  -0.406568 1.289355 3.249042
H  -0.036032 -1.348356 -1.203897
H  2.291938 -2.792044 2.100337
H  0.241475 -3.007353 3.438752
H  -1.957701 -2.459207 2.464367
H  -1.55916 -3.480987 -1.615729
H  -4.02267 -0.00899 -1.069983
H  -2.338706 -3.661434 -3.931171
H  -4.814098 -0.212063 -3.395055
H  -3.967035 -2.034957 -4.846101
elementType: Cl F O N C H
totalener: -2099.11798495 hartree
nucrepener: 4154.45784785 hartree
electener: -6253.57583280 hartree
twoeener: 4889.78189856 hartree
cpcmener: -0.04476695 hartree
kineticenergy: 2091.79092343 hartree
xcener: -173.916725933819 hartree
chargesum: -0.0000000
charge: -0.098576 -0.182200 -0.187994 -0.188118 -0.267699 -0.421422 -0.330198 -0.220770 -0.094448 0.068625 0.110968 -0.296826 -0.303578 0.336741 0.166635 0.436777 0.021873 -0.195329 0.005928 -0.031789 -0.158249 -0.217523 -0.289353 -0.182542 0.561901 0.361977 -0.235461 -0.115595 -0.279031 0.350793 -0.222385 -0.296020 -0.147061 -0.118967 -0.193450 0.061674 0.123758 0.088750 0.092842 0.097036 0.098043 0.095056 0.093026 0.154033 0.149450 0.141418 0.136609 0.144583 0.139406 0.138595 0.161414 0.143126 0.158659 0.150171 0.162506 0.161326 0.160883
qa: -0.0986 -0.1822 -0.1880 -0.1881 -0.2677 -0.4214 -0.3302 -0.2208 -0.0944 0.0686 0.1110 -0.2968 -0.3036 0.3367 0.1666 0.4368 0.0219 -0.1953 0.0059 -0.0318 -0.1582 -0.2175 -0.2894 -0.1825 0.5619 0.3620 -0.2355 -0.1156 -0.2790 0.3508 -0.2224 -0.2960 -0.1471 -0.1190 -0.1935 0.0617 0.1238 0.0887 0.0928 0.0970 0.0980 0.0951 0.0930 0.1540 0.1495 0.1414 0.1366 0.1446 0.1394 0.1386 0.1614 0.1431 0.1587 0.1502 0.1625 0.1613 0.1609
va: 1.2310 1.1123 1.1038 1.1011 2.1542 2.0750 2.0432 3.2058 3.1047 3.8008 3.8609 3.9401 3.9539 4.1061 3.8517 3.8736 3.8210 3.8511 3.6382 3.5286 3.9918 4.0448 3.9880 3.9372 4.4066 3.4993 4.0498 3.9228 4.0157 3.6262 3.9185 3.9620 3.8881 3.8986 3.9121 1.0264 1.0057 1.0013 1.0162 1.0047 1.0042 1.0035 1.0078 1.0441 0.9937 1.0182 1.0140 1.0122 1.0140 1.0181 0.9885 1.0146 0.9966 1.0124 0.9889 0.9895 0.9893
dispcorr: -0.040156786 hartree
energy: -2099.158141731498
dipole: 33.83958 -33.66413 0.17545 -1.30967 2.23056 0.92089 -16.03135 13.95465 -2.07670
magnitude: 2.27849 au
magnitude: 5.79145 debye
