program: Gaussian 09
title: 000072172
version: EM64L-G09RevD.01
frameworkgroup: C1[X(C16H24N2O4)]
method: RPBEPBE
basis: SDD
operation: Freq
keyword: #p
keyword: freq=noraman
keyword: PBEPBE/SDD
title: #p freq=noraman PBEPBE/SDD
converged: YES YES NO NO
title: Mulliken charges:
elementType: O O O O N N C C C C C C C C C C C C C C C C H H H H H H H H H H H H H H H H H H H H H H H H
charge: -0.461322 -0.274503 -0.428426 -0.218892 -0.364712 -0.653301 -0.480743 -0.000992 -0.111202 -0.070956 -0.183430 -0.618902 0.174054 -0.729296 -0.712943 0.467439 0.159333 -0.425317 -0.396095 -0.230557 -0.244596 -0.242406 0.252197 0.207378 0.197258 0.301637 0.189280 0.250335 0.265425 0.198965 0.303756 0.218543 0.236541 0.217765 0.231861 0.204503 0.218331 0.321733 0.278518 0.376649 0.229749 0.284247 0.222070 0.226428 0.387890 0.226708
chargesum: 0.00000
title: Mulliken charges with hydrogens summed into heavy atoms:
elementType: O O O O N N C C C C C C C C C C C C C C C C
charge: -0.084673 -0.274503 -0.040536 -0.218892 -0.060957 -0.053050 -0.021169 0.196267 0.190434 0.118324 0.066906 -0.154512 0.174054 -0.056447 -0.058249 0.467439 0.159333 -0.195568 -0.111848 -0.008486 -0.018168 -0.015698
polarizability: 2.12415842e+02 2.02777803e+01 1.94737266e+02 -6.36759110e+00 1.96179578e+00 1.79389629e+02
1716.lowfreq: -9.0600 -0.0079 -0.0013 0.0003 2.2995 8.8105 12.8515 14.6286 26.6317
frequency: 11.2723 12.7087 26.5306 37.2175 38.8861 45.0947 64.6855 68.8296 89.6650 107.5527 122.5268 132.0931 177.1090 200.3093 219.3714 221.7711 232.6691 241.6477 260.1752 291.8420 311.6824 320.8692 333.4025 345.0045 354.6357 370.5491 386.9550 406.0843 408.4249 414.3262 484.9543 509.0162 535.9477 538.3774 560.2283 584.1513 593.3971 615.6310 617.7278 628.6936 658.5886 684.2079 708.7330 753.3308 779.1025 785.9007 817.1153 833.5312 849.5428 861.7811 864.2798 919.0853 921.5309 931.7533 939.7198 954.6433 973.6295 981.3670 983.8517 989.9073 1000.5246 1008.5376 1028.4002 1032.3198 1061.8415 1080.6523 1091.6921 1116.3537 1129.0815 1152.0534 1166.3657 1171.5875 1190.7746 1198.1702 1202.3597 1205.7810 1218.8625 1220.7507 1250.9597 1270.6706 1276.9799 1296.0087 1304.8054 1309.6588 1330.3926 1331.1593 1337.0319 1342.5917 1356.7323 1359.3281 1381.7795 1384.9710 1386.4281 1403.7277 1440.9240 1460.4861 1466.1824 1466.5855 1478.8211 1484.5243 1486.3010 1495.0089 1497.7080 1591.0049 1606.1195 1613.6853 1646.3061 1656.1927 2818.3607 2958.3834 2971.8914 2972.5408 2978.2156 2982.3423 2998.4836 3002.1601 3050.4750 3063.0393 3066.0060 3067.2664 3071.8252 3085.1499 3109.3287 3122.4008 3133.6692 3144.1764 3160.7101 3452.5564 3471.3456 3503.5552 3541.1001 3609.9761
redmass: 5.7985 4.4210 3.4843 4.9783 5.6960 4.2217 4.7138 6.3535 3.3786 3.5493 4.7373 4.8626 3.9590 2.9512 1.2881 3.5961 1.2823 3.1941 1.0747 3.1996 3.7008 3.4803 3.7791 2.2310 2.6396 2.2371 1.7999 2.9599 3.1994 2.5301 3.0411 3.0833 2.2419 2.0652 1.7498 1.5430 4.1679 4.4827 5.9825 2.2367 3.0800 2.3716 1.9537 1.8750 4.1554 3.1852 3.6205 3.9119 1.8467 1.3238 3.9135 1.9350 1.2726 1.7900 2.1877 1.4782 2.0831 1.5509 1.9572 4.4154 1.3538 2.3044 2.1922 2.9864 2.1485 1.8424 2.0545 2.2517 2.1588 2.3146 1.2497 1.0726 1.1367 1.8728 1.4061 1.5413 1.4257 2.2968 1.7055 1.2539 1.4603 1.6323 1.4514 1.4147 1.3396 1.3805 1.4986 1.4567 1.4587 1.3124 6.8496 1.2176 1.2541 1.2114 2.1443 1.1426 1.1244 1.0454 1.0569 2.2727 1.0674 1.6710 1.0977 5.9916 6.7350 6.0173 1.0969 9.0053 1.0804 1.0780 1.0372 1.0534 1.0536 1.0639 1.0789 1.0839 1.0967 1.0991 1.0972 1.0998 1.0986 1.0987 1.0872 1.0862 1.0917 1.0961 1.1015 1.0642 1.0459 1.0638 1.0776 1.0990
irintensity: 1.0048 0.7830 0.6652 2.1508 1.3802 0.9145 1.4975 0.4090 0.4573 6.9560 1.6872 1.9990 3.1991 11.5009 13.4030 0.7315 2.1350 0.7081 1.0692 68.4104 1.1204 25.9781 1.5204 15.1806 24.2002 3.2000 26.8741 0.7920 16.8934 49.7130 6.0872 10.3297 33.2220 77.7929 67.8899 118.0424 1.4308 23.1028 3.6323 89.6848 25.7380 109.0669 49.7223 43.9973 15.8957 14.9939 8.8766 2.9450 5.6497 4.0504 30.8403 31.8357 7.0260 10.0584 5.9449 1.3213 4.2200 0.9948 3.6456 0.1087 1.9292 9.2662 7.7311 60.2352 102.0933 34.0260 36.9144 27.9967 4.8552 34.9630 44.7506 5.0465 1.2801 6.3470 1.8375 8.0381 16.6161 0.2409 75.2247 25.6214 34.7214 5.3813 45.2739 1.4829 6.8978 12.9345 0.7179 12.4200 20.1521 0.7719 0.7082 31.1215 104.3206 17.5950 9.6988 34.7926 9.6987 3.4847 2.1408 21.2332 50.9183 129.3798 15.2461 1.1010 128.5913 8.3244 57.2787 258.0356 92.8351 18.2384 33.6001 39.5449 25.6498 42.2234 11.5504 27.7616 9.2124 34.0608 6.6200 28.7552 46.3977 56.7968 10.1627 0.2971 18.6163 27.3898 27.3815 52.9212 25.2336 32.0133 13.6289 20.4901
temp: 298.150 k
press: 1.00000 atm
elementType: 8 8 8 8 7 7 6 6 6 6 6 6 6 6 6 6 6 6 6 6 6 6 1 1 1 1 1 1 1 1 1 1 1 1 1 1 1 1 1 1 1 1 1 1 1 1
symmnumber: 1
zpe: 1001500.2 jmol-1
zpe.correction: 0.381451 hartree
zpe.thermalcorrener: 0.405409 hartree
zpe.thermalcorrenthalpy: 0.406353 hartree
zpe.thermalcorrgfe: 0.324036 hartree
zpe.sumelectzpe: -1032.821120 hartree
zpe.sumelectthermal: -1032.797163 hartree
zpe.sumelectthermalent: -1032.796218 hartree
zpe.sumelectthermalfe: -1032.878536 hartree
dipole: -0.2469 0.1577 -4.4740
dipole: 4.4836
quadrupole: -144.6044 -117.4242 -136.3219
quadrupole: -3.0839 -3.0306 4.8862
quadrupole: -11.8209 15.3593 -3.5384 -3.0839 -3.0306 4.8862
hfenergy: -1033.2025716 hartree
pointgroup: C01 [X(C16H24N2O4)]
dipole: 0.0702056 -0.4500821 -1.7041595 debye
polarizability: 217.5053873|18.0652568|188.0465883|1.8365773|-4.8824463|180.9907623 unknown
InChI: InChI=1S/C16H24N2O4/c1-10(2)8-13(16(21)22)18-15(20)14(19)12(17)9-11-6-4-3-5-7-11/h3-7,10,12-14,18-19,21H,8-9,17H2,1-2H3
charge 0 multiplicity 1
46 atoms
O  -1.096464 1.068357 2.173623
O  1.555641 0.78765 1.916989
O  2.651373 1.749296 -1.525128
O  4.701278 0.676179 -1.630541
N  1.444269 -0.228072 -0.173278
N  -0.200706 2.774245 -0.223378
C  3.3374 -1.790762 -0.78504
C  3.133017 -2.956691 0.225508
C  2.893246 -0.380253 -0.307869
C  -1.035302 1.571639 -0.282257
C  -0.653206 0.586417 0.880358
C  -2.534314 1.969933 -0.17498
C  0.872413 0.380489 0.924257
C  3.772682 -2.657892 1.603186
C  1.658696 -3.404393 0.383366
C  -3.490153 0.799186 -0.343888
C  3.525194 0.693159 -1.212084
C  -3.956201 0.419902 -1.629878
C  -3.921843 0.049398 0.782688
C  -4.830065 -0.679745 -1.790893
C  -4.796477 -1.049441 0.625126
C  -5.25332 -1.419097 -0.661832
H  4.41404 -1.712388 -1.025434
H  2.818545 -2.03208 -1.736379
H  3.684375 -3.813648 -0.217441
H  3.310736 -0.184998 0.700732
H  -0.910727 0.997298 -1.238688
H  -1.163695 -0.37954 0.699025
H  -2.668319 2.445195 0.812638
H  -2.732356 2.731734 -0.955953
H  0.847631 -0.511884 -0.952914
H  4.821954 -2.322157 1.500059
H  3.212946 -1.877288 2.152005
H  3.770522 -3.564859 2.235083
H  1.053504 -2.638379 0.898576
H  1.19133 -3.612018 -0.59831
H  1.602887 -4.331923 0.982912
H  0.773266 2.651239 -0.516066
H  -0.637299 3.632439 -0.563244
H  -0.299881 1.485418 2.606614
H  -3.641624 0.998269 -2.508469
H  -3.558552 0.332724 1.777776
H  -5.186032 -0.954486 -2.790685
H  -5.123195 -1.614628 1.505618
H  3.15052 2.413028 -2.076187
H  -5.934932 -2.268773 -0.782818
