program: Orca
programVersion: 5.0.2
elementType: Cl F F F O O O N N C C C C C C C C C C C C C C C C C C C C C C C C C C H H H H H H H H H H H H H H H H H H H H H H
charge: 0
multiplicity: 1
keywords: wb97x-d3
keywords: def2-TZVPP
keywords: def2/J RIJCOSX
keywords: DEFGRID2
keywords: scfconv7
keywords: smallprint printgap noloewdin
keywords: NOSOSCF
formula: C26H22ClF3N2O3
InChI: InChI=1/C26H22ClF3N2O3/c1-16(2)24(32-22-12-11-18(14-21(22)27)26(28,29)30)25(33)35-23(15-31)17-7-6-10-20(13-17)34-19-8-4-3-5-9-19/h3-14,16,23-24,32H,1-2H3
57 atoms
Cl -0.534883 1.485936 -2.36612
F  -2.878401 0.207211 2.785548
F  -3.033215 2.288607 3.278972
F  -4.029712 1.522731 1.533685
O  2.505368 -0.151092 0.136929
O  3.870718 0.684481 1.692545
O  -1.189126 -2.667775 -2.269874
N  1.845324 2.279928 -0.748898
N  0.94942 -1.060424 2.992171
C  4.269601 2.226571 -1.149658
C  3.131822 2.121339 -0.11243
C  5.623386 2.394141 -0.471774
C  4.312165 1.072433 -2.146344
C  3.228707 0.82762 0.685437
C  0.69152 2.108605 -0.030888
C  2.398299 -1.383921 0.835273
C  -0.512347 1.733219 -0.648559
C  0.64681 2.313656 1.354826
C  1.734591 -2.373395 -0.086129
C  -1.683179 1.719764 1.441582
C  -1.67634 1.531324 0.06524
C  -0.512535 2.11657 2.075786
C  0.528271 -2.045189 -0.695317
C  2.351957 -3.589132 -0.337221
C  -2.903808 1.440314 2.250038
C  -0.050192 -2.952746 -1.569064
C  1.591676 -1.18352 2.045982
C  1.755205 -4.488928 -1.209505
C  0.555376 -4.177366 -1.825561
C  -2.252681 -2.038721 -1.671184
C  -2.627397 -2.288174 -0.356766
C  -3.001825 -1.190772 -2.474366
C  -3.769608 -1.680584 0.14623
C  -4.147148 -0.6006 -1.96073
C  -4.536949 -0.841468 -0.65037
H  4.055099 3.148072 -1.698732
H  3.287076 2.929583 0.606293
H  5.939984 1.487066 0.044995
H  5.615617 3.211044 0.250667
H  6.384583 2.620315 -1.218623
H  4.620492 0.138518 -1.672796
H  5.041873 1.293377 -2.925477
H  3.360625 0.893667 -2.649735
H  1.807521 1.937567 -1.697921
H  3.37958 -1.755862 1.143193
H  1.529699 2.639407 1.887557
H  -2.5675 1.222446 -0.465888
H  -0.484908 2.280841 3.144638
H  0.051762 -1.092376 -0.493669
H  3.293079 -3.830711 0.139313
H  2.228861 -5.439977 -1.411288
H  0.090016 -4.874745 -2.510135
H  -2.05177 -2.956687 0.270946
H  -2.694442 -1.003769 -3.495125
H  -4.067088 -1.882433 1.166419
H  -4.73285 0.056217 -2.590389
H  -5.431781 -0.380892 -0.254769
elementType: Cl F O N C H
totalener: -2099.11884986 hartree
nucrepener: 4170.64842999 hartree
electener: -6269.76727985 hartree
twoeener: 4906.71804798 hartree
cpcmener: -0.04244574 hartree
kineticenergy: 2091.78957089 hartree
xcener: -173.913396420922 hartree
chargesum: -0.0000000
charge: -0.096429 -0.187771 -0.185719 -0.183747 -0.258108 -0.425471 -0.333892 -0.250059 -0.092417 0.050677 0.146239 -0.314362 -0.289861 0.302528 0.151369 0.414441 -0.012565 -0.198554 -0.004930 -0.071716 -0.100157 -0.199863 -0.171118 -0.190424 0.563807 0.257083 -0.232194 -0.113424 -0.235622 0.325621 -0.179906 -0.299523 -0.158724 -0.086691 -0.195868 0.063914 0.130971 0.085501 0.100545 0.100850 0.085335 0.104069 0.089887 0.161067 0.133554 0.151485 0.158286 0.148431 0.116992 0.149546 0.162708 0.149946 0.152622 0.144283 0.156559 0.157483 0.153318
qa: -0.0964 -0.1878 -0.1857 -0.1837 -0.2581 -0.4255 -0.3339 -0.2501 -0.0924 0.0507 0.1462 -0.3144 -0.2899 0.3025 0.1514 0.4144 -0.0126 -0.1986 -0.0049 -0.0717 -0.1002 -0.1999 -0.1711 -0.1904 0.5638 0.2571 -0.2322 -0.1134 -0.2356 0.3256 -0.1799 -0.2995 -0.1587 -0.0867 -0.1959 0.0639 0.1310 0.0855 0.1005 0.1009 0.0853 0.1041 0.0899 0.1611 0.1336 0.1515 0.1583 0.1484 0.1170 0.1495 0.1627 0.1499 0.1526 0.1443 0.1566 0.1575 0.1533
va: 1.2335 1.0936 1.1139 1.1144 2.1709 2.0752 2.0734 3.2110 3.0921 3.8630 3.8519 3.9431 3.9409 4.1553 3.8610 3.7406 3.9341 3.8902 3.7405 3.6665 3.9007 4.0052 3.9397 3.9283 4.4154 3.7415 4.0271 3.8895 4.0010 3.6082 3.8748 3.9640 3.8277 3.8176 3.8524 1.0186 1.0042 1.0082 1.0034 1.0016 1.0094 1.0038 1.0131 1.0431 1.0220 1.0086 1.0036 1.0102 1.0323 1.0004 0.9881 1.0046 0.9997 1.0134 0.9996 0.9887 0.9971
dispcorr: -0.040727408 hartree
energy: -2099.159577264548
dipole: 36.74052 -34.42645 2.31407 -5.19940 4.98440 -0.21500 -17.14221 14.74219 -2.40002
magnitude: 3.34084 au
magnitude: 8.49174 debye
