program: Orca
programVersion: 5.0.2
elementType: Cl F F F O O O N N C C C C C C C C C C C C C C C C C C C C C C C C C C H H H H H H H H H H H H H H H H H H H H H H
charge: 0
multiplicity: 1
keywords: wb97x-d3
keywords: def2-TZVPP
keywords: def2/J RIJCOSX
keywords: DEFGRID2
keywords: scfconv7
keywords: smallprint printgap noloewdin
keywords: NOSOSCF
formula: C26H22ClF3N2O3
InChI: InChI=1/C26H22ClF3N2O3/c1-16(2)24(32-22-12-11-18(14-21(22)27)26(28,29)30)25(33)35-23(15-31)17-7-6-10-20(13-17)34-19-8-4-3-5-9-19/h3-14,16,23-24,32H,1-2H3
57 atoms
Cl 0.61671 4.871409 -0.819921
F  -4.478277 2.020617 -0.383029
F  -3.933569 2.816591 -2.304035
F  -3.820939 0.697633 -1.939693
O  2.491927 -0.883928 0.112492
O  3.027662 0.74431 -1.323867
O  -1.785314 -3.788399 0.204487
N  1.706126 2.463413 0.552901
N  5.042438 -2.381126 -1.469562
C  3.875056 1.817222 1.475192
C  2.506907 1.336822 0.958677
C  3.696757 2.70366 2.701137
C  4.788812 0.640266 1.799207
C  2.710032 0.392477 -0.219242
C  0.439477 2.314908 0.067667
C  2.538687 -1.856217 -0.93095
C  -0.216767 3.365801 -0.595686
C  -0.287102 1.126041 0.227775
C  1.738223 -3.046665 -0.467205
C  -2.190008 2.046689 -0.92172
C  -1.502984 3.242933 -1.079887
C  -1.568945 0.992974 -0.263539
C  0.364566 -2.863252 -0.345987
C  2.312651 -4.270319 -0.156413
C  -3.596057 1.899211 -1.390833
C  -0.42368 -3.908725 0.106627
C  3.939716 -2.163012 -1.227831
C  1.504154 -5.315528 0.271009
C  0.138184 -5.140153 0.415029
C  -2.333871 -2.713538 0.859857
C  -1.718314 -2.106099 1.947956
C  -3.581905 -2.289022 0.423228
C  -2.366243 -1.061682 2.593553
C  -4.221267 -1.251254 1.086692
C  -3.615715 -0.629169 2.170187
H  4.338287 2.406363 0.675665
H  2.010524 0.797559 1.769885
H  3.103755 3.593382 2.492528
H  4.66899 3.038537 3.063655
H  3.210277 2.155438 3.510589
H  4.327609 -0.033801 2.523456
H  5.717925 1.006164 2.236074
H  5.064533 0.056838 0.918873
H  2.232605 3.251063 0.203577
H  2.09475 -1.452118 -1.845981
H  0.141371 0.284971 0.754111
H  -1.953282 4.088544 -1.581988
H  -2.073716 0.046333 -0.123972
H  -0.085423 -1.91226 -0.609262
H  3.379835 -4.42674 -0.244734
H  1.947601 -6.273027 0.508097
H  -0.489659 -5.952095 0.758507
H  -0.751131 -2.439095 2.302293
H  -4.050603 -2.772639 -0.424473
H  -1.885424 -0.587817 3.439254
H  -5.194731 -0.924252 0.745815
H  -4.112137 0.18537 2.680027
elementType: Cl F O N C H
totalener: -2099.12045319 hartree
nucrepener: 3995.03177902 hartree
electener: -6094.15223221 hartree
twoeener: 4729.00822965 hartree
cpcmener: -0.04163959 hartree
kineticenergy: 2091.77187956 hartree
xcener: -173.908571828874 hartree
chargesum: 0.0000000
charge: -0.097358 -0.188897 -0.183742 -0.187653 -0.254517 -0.438235 -0.339137 -0.228326 -0.094770 0.086071 0.108005 -0.295183 -0.299200 0.319925 0.206349 0.443910 -0.056302 -0.213371 -0.043318 -0.152648 -0.067060 -0.111401 -0.205728 -0.165529 0.558310 0.236884 -0.228078 -0.120769 -0.222616 0.293864 -0.188340 -0.209070 -0.171979 -0.153820 -0.166382 0.061481 0.117821 0.091798 0.096682 0.088709 0.097700 0.095891 0.089181 0.154721 0.145023 0.150338 0.127780 0.121846 0.164765 0.139298 0.163470 0.150658 0.156024 0.145428 0.159414 0.154569 0.157512
qa: -0.0974 -0.1889 -0.1837 -0.1877 -0.2545 -0.4382 -0.3391 -0.2283 -0.0948 0.0861 0.1080 -0.2952 -0.2992 0.3199 0.2063 0.4439 -0.0563 -0.2134 -0.0433 -0.1526 -0.0671 -0.1114 -0.2057 -0.1655 0.5583 0.2369 -0.2281 -0.1208 -0.2226 0.2939 -0.1883 -0.2091 -0.1720 -0.1538 -0.1664 0.0615 0.1178 0.0918 0.0967 0.0887 0.0977 0.0959 0.0892 0.1547 0.1450 0.1503 0.1278 0.1218 0.1648 0.1393 0.1635 0.1507 0.1560 0.1454 0.1594 0.1546 0.1575
va: 1.2309 1.0960 1.1167 1.1086 2.1399 2.0678 2.0695 3.2050 3.1015 3.7950 3.8599 3.9378 3.9476 4.0965 3.9068 3.6928 3.9344 3.9311 3.7974 3.7944 3.9705 3.9738 3.9625 3.9033 4.4169 3.7495 4.0403 3.9206 4.0176 3.6615 3.8269 3.9386 3.8552 3.8549 3.8235 1.0281 1.0137 1.0174 1.0049 1.0016 1.0040 1.0042 1.0088 1.0413 1.0120 1.0020 1.0252 0.9995 0.9898 1.0143 0.9887 1.0035 0.9984 1.0081 0.9916 0.9958 0.9913
dispcorr: -0.036447611 hartree
energy: -2099.156900800085
dipole: 30.87800 -30.77038 0.10762 -17.52970 17.04209 -0.48762 27.90855 -25.68109 2.22746
magnitude: 2.28275 au
magnitude: 5.80228 debye
