program: Orca
programVersion: 5.0.2
elementType: Cl F F F O O O N N C C C C C C C C C C C C C C C C C C C C C C C C C C H H H H H H H H H H H H H H H H H H H H H H
charge: 0
multiplicity: 1
keywords: wb97x-d3
keywords: def2-TZVPP
keywords: def2/J RIJCOSX
keywords: DEFGRID2
keywords: scfconv7
keywords: smallprint printgap noloewdin
keywords: NOSOSCF
formula: C26H22ClF3N2O3
InChI: InChI=1/C26H22ClF3N2O3/c1-16(2)24(32-22-12-11-18(14-21(22)27)26(28,29)30)25(33)35-23(15-31)17-7-6-10-20(13-17)34-19-8-4-3-5-9-19/h3-14,16,23-24,32H,1-2H3
57 atoms
Cl 0.658215 3.027636 -2.439175
F  -4.084644 1.200292 1.272728
F  -4.017837 3.178821 0.437856
F  -4.182269 1.482161 -0.861896
O  3.248046 -0.357206 -0.56155
O  3.034057 -0.865237 1.602753
O  -1.550739 -1.582572 -0.941818
N  2.068625 2.058266 -0.014593
N  5.334474 -2.91136 0.195261
C  4.376378 2.114038 0.783695
C  2.984741 1.463937 0.92044
C  4.296627 3.587448 1.163516
C  5.415907 1.399691 1.639787
C  3.077684 -0.04061 0.729542
C  0.716582 1.927382 0.04286
C  3.273525 -1.732664 -0.90399
C  -0.09507 2.383506 -1.014148
C  0.050258 1.375088 1.146481
C  1.953829 -2.429609 -0.646071
C  -2.103383 1.842957 0.177151
C  -1.469457 2.349604 -0.952401
C  -1.329819 1.347697 1.217417
C  0.781084 -1.721124 -0.875883
C  1.899681 -3.754055 -0.236666
C  -3.588148 1.915849 0.259807
C  -0.444181 -2.339385 -0.678392
C  4.410279 -2.398028 -0.257209
C  0.665631 -4.366336 -0.070392
C  -0.512482 -3.671602 -0.286501
C  -2.722026 -1.818917 -0.263457
C  -3.894016 -1.815824 -1.003531
C  -2.748547 -1.995174 1.114484
C  -5.108432 -1.992278 -0.354892
C  -3.967968 -2.184669 1.747227
C  -5.150748 -2.185103 1.018775
H  4.680374 2.037278 -0.265893
H  2.640711 1.630314 1.944586
H  3.607432 4.143766 0.529241
H  5.277728 4.053408 1.066748
H  3.972644 3.705779 2.199701
H  5.610797 0.377175 1.312386
H  5.115121 1.368935 2.688789
H  6.364958 1.932931 1.584339
H  2.469987 2.344197 -0.895144
H  3.481389 -1.740367 -1.977339
H  0.613383 0.976025 1.978315
H  -2.041256 2.728616 -1.789795
H  -1.787174 0.933287 2.105221
H  0.798864 -0.690412 -1.207796
H  2.802928 -4.31941 -0.048059
H  0.621164 -5.402693 0.236019
H  -1.463536 -4.169552 -0.151868
H  -3.855885 -1.67321 -2.075868
H  -1.833071 -1.985547 1.692358
H  -6.023649 -1.986937 -0.932002
H  -3.990502 -2.328029 2.819484
H  -6.098148 -2.332967 1.519461
elementType: Cl F O N C H
totalener: -2099.11782652 hartree
nucrepener: 4080.26235622 hartree
electener: -6179.38018274 hartree
twoeener: 4816.13689667 hartree
cpcmener: -0.04519250 hartree
kineticenergy: 2091.78355158 hartree
xcener: -173.915340196714 hartree
chargesum: -0.0000000
charge: -0.099724 -0.184344 -0.189104 -0.191773 -0.269317 -0.418719 -0.335706 -0.194570 -0.093961 0.070001 0.084328 -0.298225 -0.298643 0.340291 0.134487 0.458655 0.001095 -0.177404 -0.013291 -0.060966 -0.128572 -0.202393 -0.322617 -0.201338 0.575868 0.316299 -0.235846 -0.122137 -0.213595 0.344301 -0.295951 -0.232516 -0.102659 -0.125207 -0.197138 0.065359 0.128287 0.092422 0.097709 0.089031 0.090827 0.097910 0.095284 0.154202 0.150881 0.137499 0.125836 0.147998 0.164991 0.135062 0.163822 0.156410 0.144832 0.159309 0.160038 0.161610 0.161072
qa: -0.0997 -0.1843 -0.1891 -0.1918 -0.2693 -0.4187 -0.3357 -0.1946 -0.0940 0.0700 0.0843 -0.2982 -0.2986 0.3403 0.1345 0.4587 0.0011 -0.1774 -0.0133 -0.0610 -0.1286 -0.2024 -0.3226 -0.2013 0.5759 0.3163 -0.2358 -0.1221 -0.2136 0.3443 -0.2960 -0.2325 -0.1027 -0.1252 -0.1971 0.0654 0.1283 0.0924 0.0977 0.0890 0.0908 0.0979 0.0953 0.1542 0.1509 0.1375 0.1258 0.1480 0.1650 0.1351 0.1638 0.1564 0.1448 0.1593 0.1600 0.1616 0.1611
va: 1.2273 1.1129 1.1003 1.0974 2.1503 2.0768 2.0169 3.1802 3.0949 3.7955 3.8936 3.9398 3.9561 4.0932 3.8545 3.8182 3.8553 3.8612 3.7713 3.5669 4.1049 3.9988 4.0569 3.9398 4.3859 3.7303 4.0885 3.9193 3.9363 3.4675 4.0080 3.8955 3.8480 3.8643 3.9095 1.0256 1.0062 1.0172 1.0044 1.0008 1.0073 1.0046 1.0037 1.0474 0.9885 1.0201 1.0280 1.0071 0.9891 1.0157 0.9897 0.9975 1.0099 1.0000 0.9878 0.9888 0.9892
dispcorr: -0.038295478 hartree
energy: -2099.156121999061
dipole: 30.28764 -29.89347 0.39417 -10.19239 10.72487 0.53248 14.08481 -14.67369 -0.58888
magnitude: 0.88639 au
magnitude: 2.25302 debye
