program: Orca
programVersion: 5.0.2
elementType: Cl F F F O O O N N C C C C C C C C C C C C C C C C C C C C C C C C C C H H H H H H H H H H H H H H H H H H H H H H
charge: 0
multiplicity: 1
keywords: wb97x-d3
keywords: def2-TZVPP
keywords: def2/J RIJCOSX
keywords: DEFGRID2
keywords: scfconv7
keywords: smallprint printgap noloewdin
keywords: NOSOSCF
formula: C26H22ClF3N2O3
InChI: InChI=1/C26H22ClF3N2O3/c1-16(2)24(32-22-12-11-18(14-21(22)27)26(28,29)30)25(33)35-23(15-31)17-7-6-10-20(13-17)34-19-8-4-3-5-9-19/h3-14,16,23-24,32H,1-2H3
57 atoms
Cl -0.360692 3.435306 -2.044604
F  -4.192189 1.665738 1.00258
F  -3.32472 -0.152613 1.75635
F  -3.31727 1.618967 2.967348
O  3.361902 -0.47058 0.529766
O  2.534612 0.057568 -1.47981
O  -1.205851 -3.124039 -1.529166
N  1.942371 2.576729 -0.352007
N  4.654218 -3.19402 1.899326
C  4.3680 2.465258 -0.661853
C  3.132957 1.846391 0.014972
C  4.550376 3.910727 -0.216051
C  5.624332 1.655015 -0.362124
C  2.971991 0.393164 -0.411205
C  0.71154 2.220049 0.129457
C  3.116014 -1.855223 0.267596
C  -0.469961 2.572674 -0.542418
C  0.55962 1.518709 1.334597
C  1.659799 -2.186696 0.483217
C  -1.839482 1.56203 1.14298
C  -1.722361 2.254308 -0.053586
C  -0.686257 1.199015 1.829704
C  0.87353 -2.523491 -0.609312
C  1.096125 -2.073633 1.748922
C  -3.165278 1.181062 1.707075
C  -0.481367 -2.75404 -0.427492
C  3.981385 -2.585587 1.192559
C  -0.259452 -2.311066 1.914334
C  -1.057099 -2.650974 0.831909
C  -2.438674 -2.556316 -1.74389
C  -2.684116 -1.210413 -1.498865
C  -3.425073 -3.375943 -2.27307
C  -3.940126 -0.692273 -1.781403
C  -4.672332 -2.840317 -2.561008
C  -4.937836 -1.500472 -2.311397
H  4.194484 2.449197 -1.743881
H  3.285846 1.894498 1.095615
H  4.692338 3.971475 0.865003
H  3.701563 4.539989 -0.48018
H  5.43313 4.339126 -0.691572
H  5.79072 1.564404 0.713098
H  6.495104 2.152878 -0.78882
H  5.596722 0.650754 -0.787281
H  1.955593 2.91682 -1.303761
H  3.429564 -2.125872 -0.744897
H  1.427701 1.228816 1.909292
H  -2.594575 2.549777 -0.62085
H  -0.745037 0.661463 2.767309
H  1.307854 -2.605554 -1.597782
H  1.703269 -1.800163 2.603272
H  -0.703624 -2.231016 2.897166
H  -2.113114 -2.841767 0.973939
H  -1.9096 -0.565459 -1.1016
H  -3.215908 -4.421639 -2.461289
H  -4.133871 0.355669 -1.592603
H  -5.440903 -3.479831 -2.975189
H  -5.913695 -1.088631 -2.530991
elementType: Cl F O N C H
totalener: -2099.11909161 hartree
nucrepener: 4066.61699268 hartree
electener: -6165.73608430 hartree
twoeener: 4801.57163655 hartree
cpcmener: -0.04296008 hartree
kineticenergy: 2091.76884284 hartree
xcener: -173.905472983017 hartree
chargesum: 0.0000000
charge: -0.095084 -0.185216 -0.185375 -0.187783 -0.258033 -0.443008 -0.342989 -0.238293 -0.097800 0.077395 0.117336 -0.296515 -0.303646 0.318554 0.171049 0.410186 0.016525 -0.207344 0.049322 -0.071570 -0.124063 -0.211218 -0.222516 -0.259172 0.577741 0.281929 -0.222813 -0.122101 -0.194906 0.279511 -0.178971 -0.236994 -0.155846 -0.133669 -0.186629 0.060559 0.117026 0.089044 0.092187 0.096629 0.095809 0.094768 0.094544 0.152176 0.144620 0.151032 0.128390 0.153332 0.136507 0.148572 0.164113 0.158304 0.158310 0.147623 0.156164 0.161227 0.161072
qa: -0.0951 -0.1852 -0.1854 -0.1878 -0.2580 -0.4430 -0.3430 -0.2383 -0.0978 0.0774 0.1173 -0.2965 -0.3036 0.3186 0.1710 0.4102 0.0165 -0.2073 0.0493 -0.0716 -0.1241 -0.2112 -0.2225 -0.2592 0.5777 0.2819 -0.2228 -0.1221 -0.1949 0.2795 -0.1790 -0.2370 -0.1558 -0.1337 -0.1866 0.0606 0.1170 0.0890 0.0922 0.0966 0.0958 0.0948 0.0945 0.1522 0.1446 0.1510 0.1284 0.1533 0.1365 0.1486 0.1641 0.1583 0.1583 0.1476 0.1562 0.1612 0.1611
va: 1.2360 1.1159 1.0962 1.1075 2.1455 2.0677 2.0620 3.2010 3.1106 3.7999 3.8532 3.9375 3.9445 4.1536 3.8765 3.7331 3.9084 3.8676 3.5517 3.6054 3.9634 4.0362 4.0793 3.9376 4.3904 3.7245 4.0816 3.8398 3.9023 3.7103 3.8581 3.9896 3.8847 3.8939 3.9212 1.0272 1.0134 1.0013 1.0170 1.0048 1.0034 1.0036 1.0099 1.0458 1.0146 1.0057 1.0248 1.0045 1.0244 1.0090 0.9898 0.9993 0.9886 1.0072 0.9979 0.9874 0.9898
dispcorr: -0.038134990 hartree
energy: -2099.157226604841
dipole: 32.10098 -31.37643 0.72455 -0.74927 2.07498 1.32571 -7.12637 6.94707 -0.17930
magnitude: 1.52139 au
magnitude: 3.86706 debye
