program: Orca
programVersion: 5.0.2
elementType: Cl F F F O O O N N C C C C C C C C C C C C C C C C C C C C C C C C C C H H H H H H H H H H H H H H H H H H H H H H
charge: 0
multiplicity: 1
keywords: wb97x-d3
keywords: def2-TZVPP
keywords: def2/J RIJCOSX
keywords: DEFGRID2
keywords: scfconv7
keywords: smallprint printgap noloewdin
keywords: NOSOSCF
formula: C26H22ClF3N2O3
InChI: InChI=1/C26H22ClF3N2O3/c1-16(2)24(32-22-12-11-18(14-21(22)27)26(28,29)30)25(33)35-23(15-31)17-7-6-10-20(13-17)34-19-8-4-3-5-9-19/h3-14,16,23-24,32H,1-2H3
57 atoms
Cl -0.504008 2.293039 -2.215911
F  -3.994434 0.96342 1.418426
F  -2.892493 0.329446 3.157004
F  -3.352912 2.406605 2.87471
O  2.652649 -0.328501 -0.693747
O  3.744297 -0.206302 1.251175
O  -2.439583 -1.600505 0.170429
N  1.920288 2.249616 -0.475946
N  4.497906 -3.147818 0.03157
C  4.370965 2.349986 -0.752973
C  3.182938 1.841205 0.087161
C  5.679162 2.187036 0.011507
C  4.481537 1.730119 -2.141759
C  3.238542 0.336457 0.304453
C  0.747517 1.959385 0.166929
C  2.386786 -1.718533 -0.543025
C  -0.483329 1.983527 -0.508791
C  0.70143 1.658852 1.536456
C  1.207746 -1.94743 0.371796
C  -1.696747 1.478278 1.493157
C  -1.682951 1.761566 0.134626
C  -0.493263 1.422747 2.183823
C  -0.048588 -1.669511 -0.158839
C  1.338372 -2.372986 1.685985
C  -2.979211 1.289769 2.225673
C  -1.177755 -1.856334 0.623364
C  3.582874 -2.48276 -0.177085
C  0.198988 -2.530988 2.463818
C  -1.058323 -2.282066 1.940748
C  -2.76343 -1.803638 -1.148143
C  -2.350868 -2.933838 -1.844302
C  -3.586757 -0.862885 -1.749501
C  -2.756697 -3.103551 -3.16024
C  -3.993734 -1.052014 -3.062884
C  -3.576319 -2.166606 -3.776163
H  4.182803 3.421299 -0.868912
H  3.29618 2.292585 1.075071
H  5.624171 2.635332 1.004438
H  6.488489 2.678546 -0.528667
H  5.959645 1.138972 0.128674
H  5.251949 2.252902 -2.709037
H  3.561802 1.800274 -2.724247
H  4.773121 0.679846 -2.096617
H  1.874875 2.2356 -1.48446
H  2.124126 -2.048983 -1.550346
H  1.607691 1.623529 2.123208
H  -2.598396 1.80931 -0.438914
H  -0.467425 1.200962 3.242418
H  -0.134928 -1.323849 -1.1821
H  2.309082 -2.594601 2.109088
H  0.291474 -2.863921 3.488683
H  -1.944539 -2.426905 2.544692
H  -1.722512 -3.67861 -1.372594
H  -3.918667 0.003386 -1.193037
H  -2.431985 -3.98142 -3.703205
H  -4.638219 -0.317977 -3.528156
H  -3.890723 -2.307719 -4.801494
elementType: Cl F O N C H
totalener: -2099.11672345 hartree
nucrepener: 4163.33225181 hartree
electener: -6262.44897526 hartree
twoeener: 4898.63819613 hartree
cpcmener: -0.04473984 hartree
kineticenergy: 2091.80424334 hartree
xcener: -173.919238884766 hartree
chargesum: 0.0000000
charge: -0.096950 -0.182209 -0.187190 -0.187631 -0.264347 -0.426767 -0.334389 -0.239048 -0.093723 0.061378 0.151017 -0.315426 -0.294666 0.312753 0.166720 0.427519 0.013107 -0.185274 0.007802 -0.022714 -0.158993 -0.222806 -0.256691 -0.183849 0.563564 0.337945 -0.235756 -0.117234 -0.277669 0.328393 -0.205341 -0.280256 -0.146640 -0.127268 -0.189113 0.060538 0.131298 0.100475 0.100314 0.086005 0.103178 0.093766 0.084685 0.160286 0.144955 0.142301 0.135740 0.144551 0.139231 0.138185 0.161034 0.142359 0.156752 0.150484 0.162625 0.161854 0.161136
qa: -0.0969 -0.1822 -0.1872 -0.1876 -0.2643 -0.4268 -0.3344 -0.2390 -0.0937 0.0614 0.1510 -0.3154 -0.2947 0.3128 0.1667 0.4275 0.0131 -0.1853 0.0078 -0.0227 -0.1590 -0.2228 -0.2567 -0.1838 0.5636 0.3379 -0.2358 -0.1172 -0.2777 0.3284 -0.2053 -0.2803 -0.1466 -0.1273 -0.1891 0.0605 0.1313 0.1005 0.1003 0.0860 0.1032 0.0938 0.0847 0.1603 0.1450 0.1423 0.1357 0.1446 0.1392 0.1382 0.1610 0.1424 0.1568 0.1505 0.1626 0.1619 0.1611
va: 1.2326 1.1122 1.1058 1.1009 2.1528 2.0717 2.0375 3.2265 3.1060 3.8504 3.8706 3.9409 3.9459 4.1214 3.8407 3.8803 3.8500 3.8491 3.6282 3.5135 4.0109 4.0381 3.9679 3.9347 4.4028 3.5227 4.0491 3.9200 4.0133 3.6498 3.9216 3.9656 3.8865 3.9067 3.9087 1.0201 1.0048 1.0039 1.0014 1.0082 1.0034 1.0087 1.0095 1.0408 0.9950 1.0147 1.0152 1.0136 1.0122 1.0191 0.9886 1.0151 0.9974 1.0123 0.9890 0.9895 0.9892
dispcorr: -0.040619571 hartree
energy: -2099.157343017340
dipole: 34.39645 -34.33686 0.05959 -4.50300 5.53526 1.03226 -15.95325 14.12161 -1.83164
magnitude: 2.10333 au
magnitude: 5.34625 debye
