program: Orca
programVersion: 5.0.2
elementType: Cl F F F O O O N N C C C C C C C C C C C C C C C C C C C C C C C C C C H H H H H H H H H H H H H H H H H H H H H H
charge: 0
multiplicity: 1
keywords: wb97x-d3
keywords: def2-TZVPP
keywords: def2/J RIJCOSX
keywords: DEFGRID2
keywords: scfconv7
keywords: smallprint printgap noloewdin
keywords: NOSOSCF
formula: C26H22ClF3N2O3
InChI: InChI=1/C26H22ClF3N2O3/c1-16(2)24(32-22-12-11-18(14-21(22)27)26(28,29)30)25(33)35-23(15-31)17-7-6-10-20(13-17)34-19-8-4-3-5-9-19/h3-14,16,23-24,32H,1-2H3
57 atoms
Cl 1.543782 3.380086 -2.491596
F  -3.664712 1.07746 0.166067
F  -3.695981 3.05783 -0.675776
F  -3.319024 1.367732 -1.939771
O  3.235322 -0.23076 -0.325508
O  2.75469 -0.631489 1.818598
O  -1.473434 -2.871063 1.170749
N  2.521731 2.386804 0.135009
N  3.981674 -3.45609 0.598578
C  4.742399 2.010572 1.074542
C  3.249843 1.637901 1.128504
C  4.926658 3.481295 1.429512
C  5.567975 1.129891 2.003664
C  3.04799 0.140341 0.944621
C  1.178673 2.243098 -0.055023
C  2.810348 -1.531433 -0.725731
C  0.562016 2.688942 -1.238457
C  0.338418 1.681168 0.915369
C  1.303606 -1.61764 -0.766057
C  -1.600806 2.0037 -0.469313
C  -0.794298 2.576647 -1.446124
C  -1.022793 1.562306 0.711318
C  0.565484 -2.2562 0.216598
C  0.661077 -0.974741 -1.821681
C  -3.061929 1.874092 -0.722922
C  -0.824571 -2.248267 0.144564
C  3.44913 -2.588813 0.062738
C  -0.720352 -0.979702 -1.881377
C  -1.475619 -1.612145 -0.902537
C  -2.827192 -3.11049 1.058823
C  -3.708023 -2.322455 1.781029
C  -3.277658 -4.15754 0.268683
C  -5.067076 -2.604195 1.724187
C  -4.638156 -4.423125 0.21305
C  -5.534389 -3.649976 0.940304
H  5.088774 1.850995 0.047549
H  2.880565 1.875992 2.13018
H  4.397201 4.146028 0.747943
H  5.983283 3.747004 1.38736
H  4.572065 3.684142 2.442191
H  5.575747 0.082411 1.698801
H  5.201776 1.182241 3.030814
H  6.604875 1.465785 2.005236
H  3.062757 2.63832 -0.679584
H  3.201799 -1.637924 -1.739795
H  0.743418 1.338207 1.856608
H  -1.213817 2.928453 -2.379984
H  -1.618404 1.112708 1.493755
H  1.044914 -2.767092 1.042434
H  1.238642 -0.477202 -2.590314
H  -1.2247 -0.482867 -2.698444
H  -2.555276 -1.596036 -0.967134
H  -3.335832 -1.508551 2.390255
H  -2.573041 -4.761613 -0.289249
H  -5.76092 -1.999643 2.29323
H  -4.996814 -5.241534 -0.397107
H  -6.593669 -3.865218 0.898231
elementType: Cl F O N C H
totalener: -2099.11735446 hartree
nucrepener: 4061.72315140 hartree
electener: -6160.84050586 hartree
twoeener: 4797.28985288 hartree
cpcmener: -0.04359327 hartree
kineticenergy: 2091.79858368 hartree
xcener: -173.916185962870 hartree
chargesum: 0.0000000
charge: -0.097668 -0.184351 -0.187819 -0.189962 -0.265046 -0.421267 -0.335919 -0.220417 -0.094115 0.067575 0.102009 -0.296312 -0.300959 0.340334 0.165250 0.431584 0.010812 -0.202563 0.012322 -0.059123 -0.145509 -0.183278 -0.187136 -0.285317 0.574600 0.282088 -0.237444 -0.116653 -0.206711 0.231813 -0.203030 -0.159150 -0.155996 -0.163231 -0.150137 0.061521 0.123943 0.093281 0.096911 0.089015 0.092980 0.097396 0.095093 0.153486 0.149210 0.141128 0.122626 0.151516 0.120781 0.142692 0.155001 0.145367 0.154980 0.156930 0.161273 0.162725 0.162868
qa: -0.0977 -0.1844 -0.1878 -0.1900 -0.2650 -0.4213 -0.3359 -0.2204 -0.0941 0.0676 0.1020 -0.2963 -0.3010 0.3403 0.1653 0.4316 0.0108 -0.2026 0.0123 -0.0591 -0.1455 -0.1833 -0.1871 -0.2853 0.5746 0.2821 -0.2374 -0.1167 -0.2067 0.2318 -0.2030 -0.1591 -0.1560 -0.1632 -0.1501 0.0615 0.1239 0.0933 0.0969 0.0890 0.0930 0.0974 0.0951 0.1535 0.1492 0.1411 0.1226 0.1515 0.1208 0.1427 0.1550 0.1454 0.1550 0.1569 0.1613 0.1627 0.1629
va: 1.2296 1.1118 1.1030 1.1010 2.1562 2.0729 2.0663 3.1991 3.1038 3.8036 3.8615 3.9391 3.9546 4.0945 3.8433 3.8802 3.8375 3.8691 3.6050 3.5620 4.0778 3.9614 4.0187 3.9870 4.3866 3.7978 4.0596 3.8472 3.8401 3.7060 3.9592 3.9380 3.8956 3.8903 3.8708 1.0264 1.0060 1.0167 1.0046 1.0013 1.0080 1.0043 1.0035 1.0441 0.9933 1.0202 1.0289 1.0060 1.0415 1.0065 0.9998 1.0156 1.0003 0.9969 0.9894 0.9891 0.9883
dispcorr: -0.038502151 hartree
energy: -2099.155856607384
dipole: 26.12450 -25.79711 0.32739 -8.70490 10.34821 1.64331 17.15135 -18.48617 -1.33481
magnitude: 2.14228 au
magnitude: 5.44525 debye
