program: Orca
programVersion: 5.0.2
elementType: Cl F F F O O O N N C C C C C C C C C C C C C C C C C C C C C C C C C C H H H H H H H H H H H H H H H H H H H H H H
charge: 0
multiplicity: 1
keywords: wb97x-d3
keywords: def2-TZVPP
keywords: def2/J RIJCOSX
keywords: DEFGRID2
keywords: scfconv7
keywords: smallprint printgap noloewdin
keywords: NOSOSCF
formula: C26H22ClF3N2O3
InChI: InChI=1/C26H22ClF3N2O3/c1-16(2)24(32-22-12-11-18(14-21(22)27)26(28,29)30)25(33)35-23(15-31)17-7-6-10-20(13-17)34-19-8-4-3-5-9-19/h3-14,16,23-24,32H,1-2H3
57 atoms
Cl 1.457238 3.942292 -1.864765
F  -4.066355 1.87964 0.355601
F  -3.745564 3.935241 -0.199934
F  -3.673625 2.400205 -1.69453
O  2.656836 -0.339812 -0.640978
O  2.074837 -1.140152 1.363365
O  -2.547827 -2.454579 0.154925
N  2.265725 2.179434 0.392284
N  2.900549 -3.770083 -0.456986
C  4.400899 1.312247 1.213489
C  2.870924 1.141655 1.18884
C  4.772109 2.63849 1.865635
C  5.071521 0.15378 1.94306
C  2.485458 -0.23949 0.679939
C  0.916915 2.264371 0.199567
C  2.076761 -1.446539 -1.326751
C  0.378565 3.077654 -0.815635
C  -0.004206 1.58671 1.009515
C  0.574645 -1.310199 -1.395955
C  -1.867865 2.520078 -0.191194
C  -0.978243 3.207949 -1.010177
C  -1.367379 1.710275 0.816315
C  -0.271955 -2.03095 -0.562717
C  0.063728 -0.379624 -2.292842
C  -3.330681 2.677094 -0.425755
C  -1.642567 -1.816145 -0.641294
C  2.530171 -2.733168 -0.790294
C  -1.305712 -0.172398 -2.352826
C  -2.16316 -0.886844 -1.533643
C  -2.152689 -3.532062 0.91863
C  -1.802332 -4.733088 0.317015
C  -2.17114 -3.399129 2.297573
C  -1.46932 -5.815783 1.117849
C  -1.845011 -4.493303 3.088179
C  -1.491038 -5.700852 2.502474
H  4.753932 1.321544 0.176509
H  2.510577 1.201047 2.220003
H  5.856449 2.75111 1.889437
H  4.40996 2.682414 2.894953
H  4.368443 3.496439 1.328928
H  4.95725 -0.799097 1.424451
H  4.676301 0.038702 2.954226
H  6.142151 0.340469 2.026349
H  2.845495 2.527162 -0.357637
H  2.489528 -1.380056 -2.335657
H  0.33688 0.959309 1.820239
H  -1.335048 3.843928 -1.810613
H  -2.02657 1.156645 1.470386
H  0.131694 -2.74938 0.138466
H  0.729288 0.176598 -2.940776
H  -1.711335 0.549516 -3.048224
H  -3.232753 -0.726651 -1.580995
H  -1.793745 -4.824267 -0.762242
H  -2.446386 -2.45358 2.747795
H  -1.196579 -6.755218 0.655073
H  -1.86476 -4.396065 4.165727
H  -1.234933 -6.550323 3.121333
elementType: Cl F O N C H
totalener: -2099.11736616 hartree
nucrepener: 4064.14339783 hartree
electener: -6163.26076399 hartree
twoeener: 4799.98754804 hartree
cpcmener: -0.04355831 hartree
kineticenergy: 2091.77369512 hartree
xcener: -173.911919425618 hartree
chargesum: 0.0000000
charge: -0.097057 -0.187441 -0.189132 -0.190148 -0.263018 -0.422731 -0.335553 -0.219450 -0.094599 0.067365 0.104445 -0.294472 -0.302430 0.338305 0.170727 0.428119 0.001612 -0.187362 -0.004873 -0.064860 -0.147753 -0.196767 -0.157005 -0.299254 0.579626 0.311258 -0.234947 -0.060837 -0.279083 0.249107 -0.182285 -0.206071 -0.154556 -0.148477 -0.160702 0.062105 0.122961 0.096866 0.088872 0.091843 0.093887 0.097734 0.095286 0.153578 0.147675 0.141290 0.125674 0.149841 0.127240 0.141291 0.155827 0.139969 0.157938 0.152626 0.162763 0.162160 0.162872
qa: -0.0971 -0.1874 -0.1891 -0.1901 -0.2630 -0.4227 -0.3356 -0.2194 -0.0946 0.0674 0.1044 -0.2945 -0.3024 0.3383 0.1707 0.4281 0.0016 -0.1874 -0.0049 -0.0649 -0.1478 -0.1968 -0.1570 -0.2993 0.5796 0.3113 -0.2349 -0.0608 -0.2791 0.2491 -0.1823 -0.2061 -0.1546 -0.1485 -0.1607 0.0621 0.1230 0.0969 0.0889 0.0918 0.0939 0.0977 0.0953 0.1536 0.1477 0.1413 0.1257 0.1498 0.1272 0.1413 0.1558 0.1400 0.1579 0.1526 0.1628 0.1622 0.1629
va: 1.2302 1.1136 1.1038 1.1000 2.1579 2.0685 2.0715 3.2013 3.1014 3.8029 3.8559 3.9404 3.9526 4.0964 3.8385 3.8923 3.8506 3.8500 3.6154 3.5784 4.0790 3.9656 3.8787 3.9841 4.3930 3.7412 4.0564 3.7852 3.9675 3.7051 3.9363 3.9876 3.8843 3.8864 3.8793 1.0262 1.0073 1.0046 1.0013 1.0170 1.0080 1.0043 1.0032 1.0434 0.9946 1.0223 1.0276 1.0093 1.0315 1.0066 0.9947 1.0194 0.9970 1.0022 0.9888 0.9889 0.9886
dispcorr: -0.038157662 hartree
energy: -2099.155523826446
dipole: 34.56177 -32.89859 1.66318 -22.09756 23.27563 1.17807 19.00576 -19.47986 -0.47410
magnitude: 2.09256 au
magnitude: 5.31886 debye
