program: Orca
programVersion: 5.0.2
elementType: Cl F F F O O O N N C C C C C C C C C C C C C C C C C C C C C C C C C C H H H H H H H H H H H H H H H H H H H H H H
charge: 0
multiplicity: 1
keywords: wb97x-d3
keywords: def2-TZVPP
keywords: def2/J RIJCOSX
keywords: DEFGRID2
keywords: scfconv7
keywords: smallprint printgap noloewdin
keywords: NOSOSCF
formula: C26H22ClF3N2O3
InChI: InChI=1/C26H22ClF3N2O3/c1-16(2)24(32-22-12-11-18(14-21(22)27)26(28,29)30)25(33)35-23(15-31)17-7-6-10-20(13-17)34-19-8-4-3-5-9-19/h3-14,16,23-24,32H,1-2H3
57 atoms
Cl -0.103729 1.668193 -2.474268
F  -2.877191 -0.09817 2.45439
F  -3.199599 1.992226 2.812774
F  -3.897943 1.09637 0.984347
O  2.792911 -0.152772 0.085891
O  4.450026 0.455216 1.449835
O  -1.959816 -2.014621 0.195559
N  2.10279 2.291589 -0.571882
N  2.665919 -1.765675 3.119165
C  4.511093 2.595447 -0.834012
C  3.366574 2.149209 0.10435
C  5.777952 2.947182 -0.065915
C  4.804721 1.587158 -1.942321
C  3.614541 0.741917 0.631686
C  0.912831 1.983559 0.023265
C  2.838332 -1.505844 0.520767
C  -0.229426 1.702364 -0.742374
C  0.755545 1.95694 1.417271
C  1.642164 -2.191702 -0.088318
C  -1.58211 1.421798 1.211042
C  -1.455271 1.434674 -0.169522
C  -0.464188 1.678432 1.997648
C  0.366762 -1.78011 0.283943
C  1.811667 -3.194815 -1.02872
C  -2.885157 1.105289 1.856622
C  -0.737645 -2.395037 -0.278348
C  2.764674 -1.606113 1.984049
C  0.692054 -3.797095 -1.590145
C  -0.584149 -3.408941 -1.218848
C  -3.024877 -1.83442 -0.645426
C  -2.888703 -1.330272 -1.93316
C  -4.279852 -2.113176 -0.120519
C  -4.027935 -1.112024 -2.695995
C  -5.408563 -1.880371 -0.891712
C  -5.289464 -1.383685 -2.183376
H  4.142034 3.516361 -1.294684
H  3.390117 2.806302 0.978334
H  6.254875 2.071588 0.375554
H  5.575689 3.661471 0.733585
H  6.50289 3.403969 -0.739753
H  5.260697 0.674895 -1.548925
H  5.511315 2.015632 -2.653557
H  3.918047 1.299591 -2.510973
H  2.14108 2.123081 -1.566048
H  3.768429 -1.982349 0.198064
H  1.596484 2.164737 2.065241
H  -2.299233 1.23147 -0.814254
H  -0.530709 1.66833 3.078191
H  0.222172 -0.995875 1.019564
H  2.805728 -3.507598 -1.320573
H  0.815209 -4.585892 -2.319568
H  -1.447519 -3.899099 -1.650741
H  -1.913495 -1.093733 -2.340848
H  -4.370018 -2.500644 0.886811
H  -3.922781 -0.718333 -3.698588
H  -6.385919 -2.093828 -0.478373
H  -6.171776 -1.206064 -2.783391
elementType: Cl F O N C H
totalener: -2099.11770695 hartree
nucrepener: 4143.41005907 hartree
electener: -6242.52776602 hartree
twoeener: 4879.28337723 hartree
cpcmener: -0.04648236 hartree
kineticenergy: 2091.79273809 hartree
xcener: -173.914747023557 hartree
chargesum: 0.0000000
charge: -0.100080 -0.189593 -0.187796 -0.186056 -0.244642 -0.435703 -0.327600 -0.235847 -0.092082 0.049597 0.114143 -0.307703 -0.290118 0.336509 0.167392 0.402352 0.025365 -0.208164 0.019073 -0.081066 -0.150040 -0.171473 -0.282195 -0.166306 0.577788 0.233318 -0.237365 -0.133609 -0.173532 0.357960 -0.237220 -0.299981 -0.139015 -0.105863 -0.194208 0.061374 0.129486 0.086010 0.096367 0.099403 0.090787 0.103678 0.093633 0.156159 0.142768 0.144259 0.144086 0.145079 0.153582 0.149517 0.163794 0.157430 0.148473 0.144848 0.161417 0.160830 0.160782
qa: -0.1001 -0.1896 -0.1878 -0.1861 -0.2446 -0.4357 -0.3276 -0.2358 -0.0921 0.0496 0.1141 -0.3077 -0.2901 0.3365 0.1674 0.4024 0.0254 -0.2082 0.0191 -0.0811 -0.1500 -0.1715 -0.2822 -0.1663 0.5778 0.2333 -0.2374 -0.1336 -0.1735 0.3580 -0.2372 -0.3000 -0.1390 -0.1059 -0.1942 0.0614 0.1295 0.0860 0.0964 0.0994 0.0908 0.1037 0.0936 0.1562 0.1428 0.1443 0.1441 0.1451 0.1536 0.1495 0.1638 0.1574 0.1485 0.1448 0.1614 0.1608 0.1608
va: 1.2304 1.0946 1.1101 1.1142 2.1790 2.0648 2.0357 3.2082 3.1088 3.8500 3.8721 3.9509 3.9286 4.1427 3.8558 3.7585 3.8709 3.8767 3.6934 3.5870 3.9508 4.0315 4.0101 3.9294 4.4039 3.8339 4.0577 3.8980 3.9302 3.4706 3.8806 4.0117 3.9057 3.8632 3.9112 1.0228 1.0026 1.0100 1.0030 1.0020 1.0081 1.0030 1.0121 1.0432 1.0080 1.0072 1.0078 1.0090 1.0144 1.0004 0.9891 0.9962 1.0106 1.0126 0.9891 0.9876 0.9892
dispcorr: -0.039659405 hartree
energy: -2099.157366353243
dipole: 32.96876 -31.65730 1.31146 -1.26734 1.54583 0.27849 -17.83856 14.36399 -3.47457
magnitude: 3.72426 au
magnitude: 9.46633 debye
