program: Orca
programVersion: 5.0.2
elementType: Br F F O O O C C C C C C C C C C C C C C C C C C C C C C C C H H H H H H H H H H H H H H H H H H H H H H H
charge: 0
multiplicity: 1
keywords: wb97x-d3
keywords: def2-TZVPP
keywords: def2/J RIJCOSX
keywords: DEFGRID2
keywords: scfconv7
keywords: smallprint printgap noloewdin
keywords: NOSOSCF
formula: C24H23BrF2O3
InChI: InChI=1/C24H23BrF2O3/c1-23(2,19-11-13-21(14-12-19)30-24(25,26)27)17-28-16-18-7-6-10-22(15-18)29-20-8-4-3-5-9-20/h3-15H,16-17H2,1-2H3
53 atoms
Br 2.917821 -2.82277 -1.4843
F  2.321518 -3.799713 0.934591
F  3.996499 -2.443802 0.942603
O  -3.620448 0.957389 -0.889379
O  2.032414 -1.598084 0.847833
O  0.291864 3.018828 1.668663
C  -3.575517 -1.360959 -0.188041
C  -4.081641 0.062377 0.086788
C  -2.076942 -1.446295 0.085988
C  -3.876801 -1.772875 -1.633879
C  -4.378919 -2.279264 0.736534
C  -1.568033 -2.129309 1.186898
C  -1.157066 -0.818375 -0.757111
C  -3.984112 2.28749 -0.657265
C  -0.205668 -2.206131 1.434797
C  0.206276 -0.867549 -0.517017
C  0.672081 -1.580696 0.573201
C  -3.144396 2.978926 0.389924
C  -1.808709 2.6310 0.549501
C  -3.682844 4.007557 1.153144
C  -1.013956 3.332995 1.445179
C  -2.884673 4.693751 2.055833
C  -1.546616 4.368946 2.201156
C  2.776372 -2.636163 0.458961
C  1.115058 2.622025 0.657287
C  1.013742 3.111931 -0.640138
C  2.128889 1.735242 0.992976
C  1.927394 2.695255 -1.596455
C  3.045118 1.341192 0.031238
C  2.94537 1.810543 -1.270148
H  -5.183297 0.050775 0.084604
H  -3.764117 0.369395 1.093377
H  -4.948277 -1.70939 -1.833616
H  -3.372619 -1.149291 -2.368543
H  -3.566006 -2.804235 -1.804471
H  -4.051378 -3.315975 0.653472
H  -5.434438 -2.250322 0.46385
H  -4.308929 -1.985198 1.785509
H  -2.230567 -2.625804 1.881022
H  -1.501431 -0.264828 -1.618706
H  -3.861832 2.80777 -1.611601
H  -5.048411 2.370072 -0.391729
H  0.158966 -2.737842 2.303023
H  0.896254 -0.345006 -1.166144
H  -1.392372 1.80902 -0.018548
H  -4.727483 4.27363 1.044918
H  -3.306428 5.492713 2.651307
H  -0.914995 4.90184 2.899321
H  0.236432 3.816042 -0.9060
H  2.194467 1.35985 2.005469
H  1.845033 3.078667 -2.605136
H  3.831089 0.648947 0.300392
H  3.656323 1.493534 -2.02091
totalener: -3928.09233673 hartree
nucrepener: 3592.40933572 hartree
electener: -7520.50167245 hartree
twoeener: 5060.59386330 hartree
kineticenergy: 3918.83549345 hartree
xcener: -198.391286678351 hartree
chargesum: 0.0000000
charge: -0.080521 -0.152736 -0.145402 -0.329723 -0.269888 -0.298152 0.349629 -0.070015 -0.039742 -0.314362 -0.345784 -0.159057 -0.220391 0.038615 -0.123204 -0.141212 0.169327 0.035668 -0.227119 -0.197697 0.285852 -0.079994 -0.227819 0.433138 0.310623 -0.185321 -0.234495 -0.108726 -0.094501 -0.165280 0.084466 0.110431 0.086919 0.102314 0.104359 0.109100 0.094654 0.096153 0.120622 0.128209 0.095169 0.078512 0.121378 0.141140 0.130054 0.107533 0.124776 0.124480 0.129436 0.123538 0.126202 0.124120 0.124724
qa: -0.0805 -0.1527 -0.1454 -0.3297 -0.2699 -0.2982 0.3496 -0.0700 -0.0397 -0.3144 -0.3458 -0.1591 -0.2204 0.0386 -0.1232 -0.1412 0.1693 0.0357 -0.2271 -0.1977 0.2859 -0.0800 -0.2278 0.4331 0.3106 -0.1853 -0.2345 -0.1087 -0.0945 -0.1653 0.0845 0.1104 0.0869 0.1023 0.1044 0.1091 0.0947 0.0962 0.1206 0.1282 0.0952 0.0785 0.1214 0.1411 0.1301 0.1075 0.1248 0.1245 0.1294 0.1235 0.1262 0.1241 0.1247
va: 1.1836 1.1446 1.1514 1.9723 2.0898 2.1239 3.6337 3.9437 3.7057 3.9505 3.9263 3.9937 4.0764 3.9346 4.1354 3.9994 3.8277 3.6221 3.9114 4.0141 3.7791 3.9428 4.0490 4.5700 3.7324 3.9285 3.9603 3.9218 3.8625 3.9319 1.0000 0.9869 1.0059 1.0112 1.0033 1.0013 1.0123 1.0008 1.0038 1.0259 0.9876 0.9979 1.0156 1.0016 1.0346 1.0104 0.9994 1.0144 1.0049 1.0174 0.9997 1.0104 1.0039
dispcorr: -0.033246883 hartree
energy: -3928.125583615279
dipole: -75.19071 73.68262 -1.50809 45.49208 -45.11136 0.38072 12.27975 -12.38289 -0.10314
magnitude: 1.55882 au
magnitude: 3.96220 debye
