program: Orca
programVersion: 5.0.2
elementType: Br F F O O O C C C C C C C C C C C C C C C C C C C C C C C C H H H H H H H H H H H H H H H H H H H H H H H
charge: 0
multiplicity: 1
keywords: wb97x-d3
keywords: def2-TZVPP
keywords: def2/J RIJCOSX
keywords: DEFGRID2
keywords: scfconv7
keywords: smallprint printgap noloewdin
keywords: NOSOSCF
formula: C24H23BrF2O3
InChI: InChI=1/C24H23BrF2O3/c1-23(2,19-11-13-21(14-12-19)30-24(25,26)27)17-28-16-18-7-6-10-22(15-18)29-20-8-4-3-5-9-20/h3-15H,16-17H2,1-2H3
53 atoms
Br 2.088834 -1.12285 1.9200
F  3.726788 -2.84362 0.653193
F  1.95938 -3.758717 1.460229
O  -4.012656 0.190086 0.52666
O  1.899683 -2.5882 -0.429197
O  1.013084 3.293402 0.502364
C  -3.489516 -1.092917 -1.531844
C  -3.852802 0.248088 -0.865929
C  -2.065774 -1.513944 -1.186958
C  -3.583691 -0.883388 -3.050361
C  -4.525717 -2.140386 -1.127812
C  -1.767778 -2.718945 -0.559115
C  -0.992389 -0.685963 -1.521806
C  -2.864347 0.402612 1.311885
C  -0.461232 -3.095439 -0.274813
C  0.314983 -1.035246 -1.239472
C  0.571256 -2.243477 -0.615923
C  -2.254431 1.768172 1.120706
C  -0.897696 1.895989 0.866589
C  -3.0423 2.91423 1.212318
C  -0.330791 3.156211 0.716673
C  -2.46809 4.165071 1.068813
C  -1.108105 4.296525 0.816405
C  2.419543 -2.690776 0.795356
C  1.56989 2.639377 -0.556715
C  0.957604 2.602741 -1.804939
C  2.806971 2.040955 -0.364964
C  1.600664 1.974945 -2.861068
C  3.439008 1.416666 -1.429251
C  2.841567 1.379299 -2.68102
H  -3.130854 1.02248 -1.156788
H  -4.821173 0.563648 -1.267259
H  -3.305655 -1.792769 -3.583476
H  -4.603044 -0.623335 -3.342462
H  -2.928472 -0.085225 -3.401872
H  -4.358912 -3.087955 -1.64262
H  -5.524711 -1.797012 -1.401246
H  -4.533474 -2.3275 -0.054803
H  -2.559798 -3.398481 -0.278775
H  -1.165543 0.267194 -2.005284
H  -3.202277 0.297953 2.345906
H  -2.100044 -0.365351 1.151218
H  -0.267826 -4.051874 0.189861
H  1.130917 -0.376534 -1.506084
H  -0.276561 1.010612 0.788372
H  -4.104699 2.822904 1.399287
H  -3.081697 5.052894 1.147815
H  -0.652784 5.271189 0.700269
H  -0.005865 3.073741 -1.954644
H  3.267098 2.069085 0.613569
H  1.126684 1.954952 -3.833781
H  4.401551 0.948157 -1.273423
H  3.336425 0.888718 -3.507991
totalener: -3928.09108116 hartree
nucrepener: 3693.29380324 hartree
electener: -7621.38488440 hartree
twoeener: 5160.89223563 hartree
kineticenergy: 3918.83947193 hartree
xcener: -198.394639494704 hartree
chargesum: -0.0000000
charge: -0.076056 -0.141825 -0.157269 -0.325497 -0.255310 -0.302961 0.322897 -0.067480 -0.059176 -0.308271 -0.353980 -0.137841 -0.214333 0.095869 -0.055858 -0.098113 0.072151 -0.026782 -0.102612 -0.193873 0.187590 -0.090724 -0.182708 0.436678 0.254884 -0.170034 -0.220241 -0.127194 -0.088081 -0.137890 0.090436 0.103134 0.106315 0.094130 0.092229 0.098416 0.090759 0.105780 0.120853 0.111488 0.103648 0.079784 0.126091 0.109582 0.075275 0.122469 0.125858 0.128209 0.131874 0.128132 0.125190 0.128506 0.125884
qa: -0.0761 -0.1418 -0.1573 -0.3255 -0.2553 -0.3030 0.3229 -0.0675 -0.0592 -0.3083 -0.3540 -0.1378 -0.2143 0.0959 -0.0559 -0.0981 0.0722 -0.0268 -0.1026 -0.1939 0.1876 -0.0907 -0.1827 0.4367 0.2549 -0.1700 -0.2202 -0.1272 -0.0881 -0.1379 0.0904 0.1031 0.1063 0.0941 0.0922 0.0984 0.0908 0.1058 0.1209 0.1115 0.1036 0.0798 0.1261 0.1096 0.0753 0.1225 0.1259 0.1282 0.1319 0.1281 0.1252 0.1285 0.1259
va: 1.1853 1.1600 1.1357 1.9917 2.1222 2.1023 3.6701 3.9769 3.5974 3.9321 3.9385 3.9501 3.9765 3.8848 4.0243 3.9144 3.9904 3.6623 3.8979 3.9990 3.8356 3.9245 4.0122 4.5390 3.7771 3.8678 3.9925 3.8930 3.8889 3.8998 0.9955 1.0105 1.0054 1.0085 1.0034 1.0003 1.0117 1.0118 1.0083 1.0100 0.9899 0.9863 1.0195 1.0086 1.0296 1.0187 0.9986 1.0110 1.0063 1.0152 1.0028 0.9996 1.0008
dispcorr: -0.035803666 hartree
energy: -3928.126884826579
dipole: -60.02215 59.22443 -0.79772 24.31162 -24.12047 0.19115 -40.64530 39.81760 -0.82770
magnitude: 1.16533 au
magnitude: 2.96202 debye
