program: Orca
programVersion: 5.0.2
elementType: Br F F O O O C C C C C C C C C C C C C C C C C C C C C C C C H H H H H H H H H H H H H H H H H H H H H H H
charge: 0
multiplicity: 1
keywords: wb97x-d3
keywords: def2-TZVPP
keywords: def2/J RIJCOSX
keywords: DEFGRID2
keywords: scfconv7
keywords: smallprint printgap noloewdin
keywords: NOSOSCF
formula: C24H23BrF2O3
InChI: InChI=1/C24H23BrF2O3/c1-23(2,19-11-13-21(14-12-19)30-24(25,26)27)17-28-16-18-7-6-10-22(15-18)29-20-8-4-3-5-9-20/h3-15H,16-17H2,1-2H3
53 atoms
Br 2.469159 -1.796715 -2.462019
F  2.64891 -4.06461 -1.03932
F  4.086072 -2.577198 -0.464099
O  -3.40556 0.754719 0.261444
O  2.081671 -2.334387 0.236862
O  0.311752 3.780965 1.791253
C  -3.578063 -1.642293 0.461855
C  -3.959849 -0.383547 -0.327932
C  -2.070286 -1.858886 0.37792
C  -4.362193 -2.797675 -0.165596
C  -4.02804 -1.50735 1.921488
C  -1.186639 -1.04846 1.09461
C  -1.508206 -2.847747 -0.421759
C  -3.678759 1.940456 -0.426301
C  0.183453 -1.208731 1.004909
C  -0.135679 -3.043977 -0.510121
C  0.705338 -2.211217 0.204209
C  -2.91361 3.076877 0.191026
C  -1.635142 2.865292 0.694731
C  -3.466144 4.350303 0.229493
C  -0.919095 3.928591 1.226837
C  -2.741614 5.406148 0.762053
C  -1.466206 5.205022 1.259685
C  2.81276 -2.757988 -0.790674
C  1.193585 2.84451 1.338689
C  1.953553 2.18224 2.293324
C  1.392446 2.593515 -0.013852
C  2.919957 1.272383 1.890472
C  2.349409 1.668465 -0.400814
C  3.118371 1.004951 0.544066
H  -3.616798 -0.492187 -1.368883
H  -5.058882 -0.305116 -0.358647
H  -4.107692 -3.750386 0.299799
H  -5.432588 -2.642945 -0.023966
H  -4.19055 -2.890302 -1.239498
H  -3.785045 -2.411437 2.480863
H  -5.109364 -1.364757 1.972201
H  -3.569038 -0.6643 2.433026
H  -1.56196 -0.268052 1.740083
H  -2.138381 -3.512518 -0.995147
H  -3.394217 1.844383 -1.486012
H  -4.755207 2.167264 -0.413991
H  0.849712 -0.555643 1.553325
H  0.236609 -3.849867 -1.124801
H  -1.205009 1.872736 0.671669
H  -4.46704 4.518936 -0.148603
H  -3.17567 6.396717 0.793038
H  -0.895491 6.021836 1.680916
H  1.791797 2.393792 3.342236
H  0.808241 3.114832 -0.761065
H  3.514269 0.7632 2.637782
H  2.49678 1.467338 -1.453261
H  3.861905 0.284445 0.233475
totalener: -3928.09282600 hartree
nucrepener: 3557.80771914 hartree
electener: -7485.90054514 hartree
twoeener: 5025.63440812 hartree
kineticenergy: 3918.81545480 hartree
xcener: -198.388715688274 hartree
chargesum: -0.0000000
charge: -0.087923 -0.154993 -0.144863 -0.319649 -0.240086 -0.297146 0.303142 -0.036422 -0.026554 -0.335676 -0.317997 -0.186195 -0.182199 0.071438 -0.141981 -0.101264 0.131127 0.010898 -0.196726 -0.192182 0.281471 -0.083190 -0.224714 0.429415 0.267879 -0.224060 -0.173805 -0.090379 -0.079143 -0.179284 0.087550 0.080168 0.111831 0.094971 0.090493 0.104259 0.086144 0.104537 0.128879 0.117000 0.080079 0.069186 0.144445 0.128975 0.109351 0.104934 0.122662 0.123906 0.123233 0.129386 0.128779 0.124587 0.125705
qa: -0.0879 -0.1550 -0.1449 -0.3196 -0.2401 -0.2971 0.3031 -0.0364 -0.0266 -0.3357 -0.3180 -0.1862 -0.1822 0.0714 -0.1420 -0.1013 0.1311 0.0109 -0.1967 -0.1922 0.2815 -0.0832 -0.2247 0.4294 0.2679 -0.2241 -0.1738 -0.0904 -0.0791 -0.1793 0.0875 0.0802 0.1118 0.0950 0.0905 0.1043 0.0861 0.1045 0.1289 0.1170 0.0801 0.0692 0.1444 0.1290 0.1094 0.1049 0.1227 0.1239 0.1232 0.1294 0.1288 0.1246 0.1257
va: 1.1713 1.1365 1.1518 1.9983 2.1369 2.1205 3.7090 3.9455 3.7189 3.9223 3.9440 4.0982 4.0489 3.9230 3.9903 3.9929 3.9604 3.8354 3.9273 4.0076 3.7657 3.9575 4.0367 4.5597 3.7771 4.0021 3.9645 3.8970 3.8761 3.9094 1.0012 0.9943 1.0018 1.0117 1.0026 1.0034 1.0066 1.0116 1.0066 1.0075 0.9853 0.9942 1.0068 1.0227 1.0328 1.0136 0.9999 1.0147 1.0157 1.0044 0.9996 1.0046 1.0120
dispcorr: -0.031805630 hartree
energy: -3928.124631630347
dipole: -69.72499 68.33243 -1.39257 30.98169 -30.96911 0.01258 34.73467 -35.09451 -0.35984
magnitude: 1.43836 au
magnitude: 3.65603 debye
