program: Orca
programVersion: 5.0.2
elementType: Br F F O O O C C C C C C C C C C C C C C C C C C C C C C C C H H H H H H H H H H H H H H H H H H H H H H H
charge: 0
multiplicity: 1
keywords: wb97x-d3
keywords: def2-TZVPP
keywords: def2/J RIJCOSX
keywords: DEFGRID2
keywords: scfconv7
keywords: smallprint printgap noloewdin
keywords: NOSOSCF
formula: C24H23BrF2O3
InChI: InChI=1/C24H23BrF2O3/c1-23(2,19-11-13-21(14-12-19)30-24(25,26)27)17-28-16-18-7-6-10-22(15-18)29-20-8-4-3-5-9-20/h3-15H,16-17H2,1-2H3
53 atoms
Br 1.939928 -3.935087 -0.35443
F  3.644209 -1.920078 0.179845
F  2.503222 -1.6463 -1.61992
O  -4.072599 0.75356 1.196676
O  1.612601 -1.280714 0.385329
O  0.730617 1.973546 0.250111
C  -4.048728 -1.163727 -0.236954
C  -4.428222 0.313486 -0.086263
C  -2.535601 -1.272187 -0.096849
C  -4.497862 -1.636046 -1.624242
C  -4.798046 -1.992108 0.807569
C  -1.702889 -0.726148 -1.07348
C  -1.926432 -1.839914 1.016163
C  -3.989496 2.144782 1.330885
C  -0.324494 -0.737116 -0.95546
C  -0.546438 -1.862866 1.154126
C  0.244878 -1.309574 0.167811
C  -2.788763 2.736417 0.632758
C  -1.546977 2.124335 0.762875
C  -2.902788 3.894998 -0.124653
C  -0.436485 2.666018 0.134932
C  -1.785034 4.434547 -0.745461
C  -0.547553 3.824379 -0.628461
C  2.43229 -2.04345 -0.339421
C  1.928269 2.620331 0.327642
C  3.001222 2.046359 -0.339835
C  2.105638 3.769145 1.089328
C  4.25638 2.625403 -0.24271
C  3.36539 4.342549 1.169447
C  4.445092 3.776977 0.50688
H  -3.919307 0.899684 -0.863935
H  -5.51082 0.434718 -0.249815
H  -4.205638 -2.672982 -1.790783
H  -5.58407 -1.577769 -1.715144
H  -4.073092 -1.041114 -2.433117
H  -4.538867 -3.04973 0.732628
H  -5.873832 -1.908048 0.643141
H  -4.602305 -1.66291 1.82679
H  -2.127261 -0.249538 -1.947758
H  -2.523212 -2.269679 1.80759
H  -4.903972 2.64116 0.974275
H  -3.92442 2.340117 2.404422
H  0.284215 -0.270868 -1.716466
H  -0.088785 -2.299961 2.0317
H  -1.437037 1.213904 1.339981
H  -3.867633 4.374887 -0.236537
H  -1.879292 5.332758 -1.341801
H  0.316438 4.241224 -1.129647
H  2.851837 1.146065 -0.92023
H  1.27177 4.209787 1.620729
H  5.090776 2.171156 -0.760717
H  3.502156 5.236162 1.764118
H  5.425556 4.227747 0.578036
totalener: -3928.09180760 hartree
nucrepener: 3576.11001603 hartree
electener: -7504.20182363 hartree
twoeener: 5044.55384998 hartree
kineticenergy: 3918.84904462 hartree
xcener: -198.391558279340 hartree
chargesum: 0.0000000
charge: -0.072217 -0.142846 -0.166967 -0.313620 -0.269824 -0.283756 0.320559 -0.083569 -0.021646 -0.302956 -0.346430 -0.147173 -0.150473 0.044294 -0.159228 -0.122540 0.151947 0.032383 -0.260511 -0.155884 0.248492 -0.101648 -0.194426 0.439870 0.283782 -0.210723 -0.188006 -0.101539 -0.108529 -0.146703 0.098299 0.089078 0.108026 0.093025 0.090639 0.107280 0.088520 0.102582 0.106032 0.114026 0.076515 0.096032 0.113454 0.127417 0.137983 0.106700 0.125997 0.135329 0.107189 0.131517 0.125028 0.125284 0.123936
qa: -0.0722 -0.1428 -0.1670 -0.3136 -0.2698 -0.2838 0.3206 -0.0836 -0.0216 -0.3030 -0.3464 -0.1472 -0.1505 0.0443 -0.1592 -0.1225 0.1519 0.0324 -0.2605 -0.1559 0.2485 -0.1016 -0.1944 0.4399 0.2838 -0.2107 -0.1880 -0.1015 -0.1085 -0.1467 0.0983 0.0891 0.1080 0.0930 0.0906 0.1073 0.0885 0.1026 0.1060 0.1140 0.0765 0.0960 0.1135 0.1274 0.1380 0.1067 0.1260 0.1353 0.1072 0.1315 0.1250 0.1253 0.1239
va: 1.1888 1.1604 1.1270 1.9837 2.0937 2.1025 3.7072 3.9869 3.6345 3.9220 3.9250 4.0240 4.0029 3.9360 4.0888 4.0565 3.8041 3.5913 4.0041 3.9696 3.7978 3.9657 3.9864 4.5509 3.7667 4.0328 3.9685 3.9629 3.9473 3.9631 0.9828 1.0050 1.0047 1.0073 1.0066 1.0003 1.0106 1.0125 1.0149 1.0096 0.9964 0.9897 1.0187 1.0118 1.0123 1.0118 1.0004 1.0038 1.0311 1.0052 1.0003 0.9998 1.0005
dispcorr: -0.032661940 hartree
energy: -3928.124469540649
dipole: -61.53536 60.36401 -1.17135 60.35970 -59.55116 0.80854 5.10932 -5.29838 -0.18906
magnitude: 1.43581 au
magnitude: 3.64953 debye
