program: Orca
programVersion: 5.0.2
elementType: Br F F O O O C C C C C C C C C C C C C C C C C C C C C C C C H H H H H H H H H H H H H H H H H H H H H H H
charge: 0
multiplicity: 1
keywords: wb97x-d3
keywords: def2-TZVPP
keywords: def2/J RIJCOSX
keywords: DEFGRID2
keywords: scfconv7
keywords: smallprint printgap noloewdin
keywords: NOSOSCF
formula: C24H23BrF2O3
InChI: InChI=1/C24H23BrF2O3/c1-23(2,19-11-13-21(14-12-19)30-24(25,26)27)17-28-16-18-7-6-10-22(15-18)29-20-8-4-3-5-9-20/h3-15H,16-17H2,1-2H3
53 atoms
Br 1.82774 -1.120434 2.261509
F  3.81566 -2.070616 0.716025
F  2.380593 -3.559588 1.291729
O  -3.82535 0.140963 0.875489
O  1.952462 -2.107046 -0.334819
O  0.445338 3.789926 -0.831022
C  -3.627208 -1.291436 -1.13431
C  -3.961613 0.082675 -0.520137
C  -2.146592 -1.589973 -0.946104
C  -3.959313 -1.219376 -2.630365
C  -4.523409 -2.352543 -0.496661
C  -1.685872 -2.616464 -0.129347
C  -1.18527 -0.785351 -1.560502
C  -2.591637 0.591495 1.387793
C  -0.332316 -2.828261 0.096198
C  0.167245 -0.964285 -1.336724
C  0.585862 -1.980689 -0.495498
C  -2.231994 1.984013 0.934203
C  -1.025112 2.209927 0.282953
C  -3.110668 3.040227 1.144957
C  -0.694212 3.488637 -0.150217
C  -2.770631 4.31262 0.714037
C  -1.567919 4.546077 0.068142
C  2.51702 -2.298619 0.856805
C  1.416069 2.849688 -1.033034
C  1.702523 2.482004 -2.339313
C  2.14616 2.322388 0.024133
C  2.734454 1.587862 -2.588777
C  3.165241 1.419652 -0.235919
C  3.463072 1.047699 -1.539357
H  -3.376531 0.866777 -1.017726
H  -5.013409 0.298175 -0.73671
H  -3.724075 -2.162023 -3.125105
H  -5.022705 -1.021822 -2.777925
H  -3.409503 -0.431135 -3.145699
H  -4.333381 -3.342334 -0.915271
H  -5.570882 -2.115333 -0.688996
H  -4.401219 -2.405742 0.584444
H  -2.385115 -3.275406 0.364782
H  -1.486626 0.030537 -2.205051
H  -2.715936 0.580454 2.473368
H  -1.768298 -0.093597 1.159149
H  -0.023722 -3.645732 0.731665
H  0.896624 -0.308615 -1.795368
H  -0.357514 1.374957 0.113423
H  -4.056834 2.866405 1.64123
H  -3.449826 5.138458 0.880918
H  -1.303621 5.537483 -0.275502
H  1.129598 2.910458 -3.151453
H  1.922426 2.617753 1.041184
H  2.963306 1.309471 -3.609111
H  3.733761 1.009607 0.587461
H  4.26077 0.34413 -1.733885
totalener: -3928.09017870 hartree
nucrepener: 3698.91505504 hartree
electener: -7627.00523374 hartree
twoeener: 5166.44458634 hartree
kineticenergy: 3918.83036641 hartree
xcener: -198.396307675842 hartree
chargesum: 0.0000000
charge: -0.083426 -0.145870 -0.155111 -0.326236 -0.243126 -0.296452 0.313326 -0.075160 -0.020430 -0.310063 -0.349115 -0.150906 -0.250017 0.113449 -0.070533 -0.112959 0.080133 -0.042253 -0.172149 -0.214627 0.292772 -0.070099 -0.224287 0.440431 0.273450 -0.233066 -0.149876 -0.075610 -0.146817 -0.144006 0.096253 0.100866 0.105043 0.094404 0.092585 0.102850 0.090044 0.103752 0.119974 0.112687 0.102015 0.056668 0.133051 0.140985 0.081955 0.118005 0.123424 0.122906 0.123850 0.131459 0.129764 0.138754 0.127340
qa: -0.0834 -0.1459 -0.1551 -0.3262 -0.2431 -0.2965 0.3133 -0.0752 -0.0204 -0.3101 -0.3491 -0.1509 -0.2500 0.1134 -0.0705 -0.1130 0.0801 -0.0423 -0.1721 -0.2146 0.2928 -0.0701 -0.2243 0.4404 0.2734 -0.2331 -0.1499 -0.0756 -0.1468 -0.1440 0.0963 0.1009 0.1050 0.0944 0.0926 0.1028 0.0900 0.1038 0.1200 0.1127 0.1020 0.0567 0.1331 0.1410 0.0820 0.1180 0.1234 0.1229 0.1239 0.1315 0.1298 0.1388 0.1273
va: 1.1720 1.1520 1.1386 1.9930 2.1275 2.1269 3.6929 3.9884 3.5820 3.9338 3.9241 3.9762 4.0561 3.9051 3.9756 3.8987 3.9748 3.7400 3.8614 4.0217 3.7910 3.9271 4.0228 4.5398 3.7625 4.0105 3.9269 3.8651 3.8813 3.9203 0.9918 1.0098 1.0045 1.0080 1.0045 1.0001 1.0112 1.0140 1.0107 1.0159 0.9906 0.9869 1.0206 1.0085 1.0216 1.0179 0.9984 1.0160 1.0146 1.0075 0.9975 1.0023 1.0055
dispcorr: -0.036049627 hartree
energy: -3928.126228330448
dipole: -57.74793 57.22073 -0.52720 21.19031 -21.24966 -0.05935 -38.79020 38.23657 -0.55363
magnitude: 0.76679 au
magnitude: 1.94903 debye
