program: Orca
programVersion: 5.0.2
elementType: Br F F O O O C C C C C C C C C C C C C C C C C C C C C C C C H H H H H H H H H H H H H H H H H H H H H H H
charge: 0
multiplicity: 1
keywords: wb97x-d3
keywords: def2-TZVPP
keywords: def2/J RIJCOSX
keywords: DEFGRID2
keywords: scfconv7
keywords: smallprint printgap noloewdin
keywords: NOSOSCF
formula: C24H23BrF2O3
InChI: InChI=1/C24H23BrF2O3/c1-23(2,19-11-13-21(14-12-19)30-24(25,26)27)17-28-16-18-7-6-10-22(15-18)29-20-8-4-3-5-9-20/h3-15H,16-17H2,1-2H3
53 atoms
Br 3.366658 -2.302874 1.256512
F  3.831116 -2.332939 -1.389733
F  2.195188 -3.589363 -0.773391
O  -3.750056 0.792368 -0.290397
O  1.95788 -1.387759 -0.959167
O  0.519447 3.461114 -1.06412
C  -3.119006 -0.632171 1.520765
C  -3.617237 0.754598 1.104579
C  -1.76834 -0.87717 0.859075
C  -4.160473 -1.684091 1.135325
C  -2.975425 -0.648577 3.047515
C  -0.656943 -0.128772 1.244212
C  -1.592289 -1.804713 -0.1620
C  -4.159304 2.026659 -0.799128
C  0.58389 -0.306729 0.659078
C  -0.357254 -2.001113 -0.762758
C  0.724347 -1.254136 -0.337675
C  -3.098442 3.100259 -0.744671
C  -1.753238 2.773601 -0.878729
C  -3.464572 4.435067 -0.615454
C  -0.801072 3.780702 -0.890835
C  -2.504632 5.434865 -0.639541
C  -1.163018 5.113754 -0.773058
C  2.764871 -2.391209 -0.606068
C  1.26269 3.10131 0.01441
C  0.81227 3.187763 1.326694
C  2.544213 2.629536 -0.254673
C  1.650628 2.790719 2.36081
C  3.367526 2.241881 0.787484
C  2.926185 2.314765 2.103309
H  -4.585022 0.957365 1.591254
H  -2.91593 1.523547 1.458862
H  -4.387965 -1.682082 0.070703
H  -3.830355 -2.686189 1.413833
H  -5.094305 -1.49019 1.665624
H  -2.5828 -1.607556 3.386469
H  -3.944935 -0.498109 3.526306
H  -2.306403 0.128785 3.417549
H  -0.741863 0.624468 2.016714
H  -2.425995 -2.394084 -0.51479
H  -4.431718 1.847873 -1.842996
H  -5.067763 2.387527 -0.29366
H  1.428228 0.291735 0.971713
H  -0.253594 -2.716212 -1.567202
H  -1.441957 1.739875 -0.976053
H  -4.509778 4.697786 -0.501509
H  -2.801167 6.471171 -0.545538
H  -0.402528 5.883441 -0.790299
H  -0.17961 3.557966 1.550135
H  2.87989 2.561988 -1.281118
H  1.294055 2.858418 3.380703
H  4.359175 1.868557 0.568391
H  3.569879 2.004287 2.914723
totalener: -3928.09390588 hartree
nucrepener: 3596.19664126 hartree
electener: -7524.29054714 hartree
twoeener: 5064.37961518 hartree
kineticenergy: 3918.84816961 hartree
xcener: -198.392436712831 hartree
chargesum: 0.0000000
charge: -0.087115 -0.140844 -0.154494 -0.312888 -0.265233 -0.295183 0.318251 -0.077453 0.021045 -0.349266 -0.302605 -0.260688 -0.154826 0.036748 -0.084253 -0.093273 0.133969 0.022752 -0.208290 -0.155589 0.208577 -0.110886 -0.159541 0.430689 0.312421 -0.227844 -0.214592 -0.126850 -0.090452 -0.147579 0.089477 0.093091 0.102308 0.108158 0.087999 0.108673 0.092526 0.089197 0.103935 0.115227 0.098427 0.077916 0.123468 0.118468 0.142820 0.109785 0.127374 0.126983 0.123863 0.122311 0.125583 0.124590 0.123113
qa: -0.0871 -0.1408 -0.1545 -0.3129 -0.2652 -0.2952 0.3183 -0.0775 0.0210 -0.3493 -0.3026 -0.2607 -0.1548 0.0367 -0.0843 -0.0933 0.1340 0.0228 -0.2083 -0.1556 0.2086 -0.1109 -0.1595 0.4307 0.3124 -0.2278 -0.2146 -0.1268 -0.0905 -0.1476 0.0895 0.0931 0.1023 0.1082 0.0880 0.1087 0.0925 0.0892 0.1039 0.1152 0.0984 0.0779 0.1235 0.1185 0.1428 0.1098 0.1274 0.1270 0.1239 0.1223 0.1256 0.1246 0.1231
va: 1.1761 1.1599 1.1392 1.9839 2.1139 2.1108 3.7119 3.9574 3.6268 3.9268 3.9260 4.0757 4.0106 3.9407 3.9569 4.0548 3.9180 3.6014 4.0086 3.9819 3.8256 3.9477 4.0190 4.5700 3.7296 3.8581 3.9843 3.9196 3.9088 3.9148 1.0062 0.9841 1.0120 1.0009 1.0106 1.0052 1.0068 1.0056 1.0153 1.0077 0.9879 0.9985 0.9871 1.0162 1.0118 1.0093 0.9999 1.0088 1.0149 1.0174 1.0014 1.0014 1.0020
dispcorr: -0.033421134 hartree
energy: -3928.127327015184
dipole: -75.09313 73.61615 -1.47697 48.10641 -47.29937 0.80705 5.49150 -4.77152 0.71998
magnitude: 1.83061 au
magnitude: 4.65305 debye
