program: Orca
programVersion: 5.0.2
elementType: Br F F O O O C C C C C C C C C C C C C C C C C C C C C C C C H H H H H H H H H H H H H H H H H H H H H H H
charge: 0
multiplicity: 1
keywords: wb97x-d3
keywords: def2-TZVPP
keywords: def2/J RIJCOSX
keywords: DEFGRID2
keywords: scfconv7
keywords: smallprint printgap noloewdin
keywords: NOSOSCF
formula: C24H23BrF2O3
InChI: InChI=1/C24H23BrF2O3/c1-23(2,19-11-13-21(14-12-19)30-24(25,26)27)17-28-16-18-7-6-10-22(15-18)29-20-8-4-3-5-9-20/h3-15H,16-17H2,1-2H3
53 atoms
Br 2.067271 -0.855113 2.134832
F  3.180524 -1.564182 -0.206115
F  3.478659 -3.007904 1.348773
O  -4.165758 0.32822 0.613588
O  1.561611 -2.961711 0.404417
O  1.021195 3.114071 0.474453
C  -3.603495 -1.206445 -1.255829
C  -3.924554 0.218333 -0.76435
C  -2.225509 -1.657355 -0.785705
C  -3.611232 -1.166576 -2.791213
C  -4.715782 -2.148561 -0.797751
C  -1.085512 -0.951752 -1.171962
C  -2.032981 -2.777261 0.017416
C  -3.05278 0.56557 1.441844
C  0.191135 -1.332739 -0.792715
C  -0.766776 -3.172065 0.420864
C  0.339712 -2.45209 0.011276
C  -2.350825 1.865057 1.138802
C  -0.981466 1.885422 0.924832
C  -3.068482 3.058456 1.073959
C  -0.334184 3.08587 0.657867
C  -2.414776 4.249827 0.814471
C  -1.041985 4.272578 0.598809
C  2.579142 -2.199573 0.807385
C  1.551879 2.421478 -0.570719
C  2.851476 1.954675 -0.421546
C  0.863945 2.2114 -1.760739
C  3.462795 1.28202 -1.465857
C  1.487831 1.528986 -2.795774
C  2.78488 1.058546 -2.656058
H  -3.142802 0.915397 -1.094198
H  -4.848888 0.536205 -1.257117
H  -2.903396 -0.440099 -3.192724
H  -3.348949 -2.141068 -3.203379
H  -4.601494 -0.899967 -3.165574
H  -5.677488 -1.794245 -1.172218
H  -4.795912 -2.204397 0.28709
H  -4.570577 -3.158183 -1.185457
H  -1.175284 -0.068688 -1.791776
H  -2.877079 -3.362255 0.353755
H  -3.454581 0.59644 2.457728
H  -2.32959 -0.256561 1.413939
H  1.035752 -0.754044 -1.140833
H  -0.638141 -4.042877 1.049921
H  -0.412413 0.963376 0.962847
H  -4.139838 3.050448 1.229635
H  -2.975028 5.174647 0.772138
H  -0.524178 5.199288 0.3894
H  3.371511 2.119242 0.512632
H  -0.143619 2.586306 -1.887777
H  4.474495 0.919889 -1.341582
H  0.952309 1.37073 -3.722977
H  3.263594 0.525793 -3.466201
totalener: -3928.09009342 hartree
nucrepener: 3721.48965804 hartree
electener: -7649.57975146 hartree
twoeener: 5189.10800297 hartree
kineticenergy: 3918.83136467 hartree
xcener: -198.394730550675 hartree
chargesum: -0.0000000
charge: -0.076946 -0.148602 -0.139560 -0.324887 -0.248947 -0.299565 0.313082 -0.062665 -0.060655 -0.308983 -0.352961 -0.212253 -0.126927 0.088989 -0.141393 -0.114681 0.152940 -0.028905 -0.119617 -0.188784 0.201050 -0.096569 -0.172615 0.427706 0.274140 -0.220876 -0.181347 -0.107802 -0.151700 -0.115549 0.086862 0.104279 0.091513 0.107006 0.094272 0.090526 0.104454 0.100740 0.105603 0.121293 0.103623 0.082149 0.129790 0.126696 0.083857 0.122768 0.125978 0.127567 0.126887 0.131850 0.128663 0.124186 0.124322
qa: -0.0769 -0.1486 -0.1396 -0.3249 -0.2489 -0.2996 0.3131 -0.0627 -0.0607 -0.3090 -0.3530 -0.2123 -0.1269 0.0890 -0.1414 -0.1147 0.1529 -0.0289 -0.1196 -0.1888 0.2010 -0.0966 -0.1726 0.4277 0.2741 -0.2209 -0.1813 -0.1078 -0.1517 -0.1155 0.0869 0.1043 0.0915 0.1070 0.0943 0.0905 0.1045 0.1007 0.1056 0.1213 0.1036 0.0821 0.1298 0.1267 0.0839 0.1228 0.1260 0.1276 0.1269 0.1318 0.1287 0.1242 0.1243
va: 1.1744 1.1312 1.1616 1.9919 2.1424 2.1105 3.6785 3.9746 3.6102 3.9333 3.9357 3.9988 3.9506 3.8910 3.9129 4.0556 3.8955 3.6699 3.9253 3.9939 3.8182 3.9227 4.0143 4.5514 3.7631 3.9617 3.8372 3.8879 3.9198 3.9005 0.9964 1.0101 1.0026 1.0051 1.0086 1.0116 1.0119 1.0000 1.0123 1.0069 0.9899 0.9844 1.0084 1.0127 1.0113 1.0183 0.9989 1.0109 1.0165 1.0066 0.9999 1.0038 1.0003
dispcorr: -0.036583764 hartree
energy: -3928.126677188715
dipole: -62.34849 61.51518 -0.83330 17.05725 -17.01931 0.03794 -39.60103 38.93023 -0.67080
magnitude: 1.07043 au
magnitude: 2.72081 debye
