program: Orca
programVersion: 5.0.2
elementType: Br F F O O O C C C C C C C C C C C C C C C C C C C C C C C C H H H H H H H H H H H H H H H H H H H H H H H
charge: 0
multiplicity: 1
keywords: wb97x-d3
keywords: def2-TZVPP
keywords: def2/J RIJCOSX
keywords: DEFGRID2
keywords: scfconv7
keywords: smallprint printgap noloewdin
keywords: NOSOSCF
formula: C24H23BrF2O3
InChI: InChI=1/C24H23BrF2O3/c1-23(2,19-11-13-21(14-12-19)30-24(25,26)27)17-28-16-18-7-6-10-22(15-18)29-20-8-4-3-5-9-20/h3-15H,16-17H2,1-2H3
53 atoms
Br 2.301118 -2.640795 -2.259142
F  1.425902 -5.070706 -1.537638
F  3.467629 -4.703407 -0.986829
O  -3.719173 1.35553 0.548307
O  1.941704 -3.818498 0.225934
O  -0.290391 5.04434 0.637483
C  -2.339296 -0.309492 1.594485
C  -2.673765 0.449258 0.301713
C  -1.199468 -1.259771 1.246635
C  -3.559242 -1.098697 2.087175
C  -1.939867 0.690472 2.681722
C  -1.421013 -2.346796 0.401124
C  0.09678 -1.07709 1.719162
C  -4.071393 2.151342 -0.544551
C  -0.40861 -3.216855 0.03256
C  1.127795 -1.928311 1.353602
C  0.872537 -2.990826 0.508877
C  -3.04132 3.196844 -0.90352
C  -2.14415 3.654439 0.049703
C  -2.999143 3.730904 -2.187296
C  -1.196022 4.608742 -0.289997
C  -2.077904 4.716088 -2.504996
C  -1.159032 5.154339 -1.562479
C  2.262425 -4.155834 -1.026596
C  0.45065 4.104833 1.292914
C  0.953469 2.979618 0.648025
C  0.727065 4.32598 2.634963
C  1.740158 2.083905 1.355176
C  1.515482 3.421679 3.329837
C  2.023388 2.29618 2.697086
H  -1.769242 0.962784 -0.053216
H  -2.966563 -0.259764 -0.487549
H  -3.949983 -1.778643 1.329555
H  -3.301977 -1.69421 2.963806
H  -4.368632 -0.424258 2.363514
H  -2.788235 1.319998 2.944689
H  -1.12797 1.350263 2.367609
H  -1.622431 0.176501 3.59046
H  -2.413549 -2.539139 0.014564
H  0.327883 -0.253505 2.378929
H  -4.287013 1.538488 -1.432642
H  -5.007724 2.645117 -0.270174
H  -0.635087 -4.055831 -0.609163
H  2.131227 -1.768711 1.726212
H  -2.171713 3.259016 1.057619
H  -3.688932 3.375575 -2.943736
H  -2.055124 5.131598 -3.503822
H  -0.416872 5.902003 -1.808692
H  0.743525 2.806085 -0.399575
H  0.326851 5.204653 3.123573
H  2.134044 1.213765 0.845798
H  1.728959 3.598637 4.375747
H  2.641108 1.59516 3.242484
totalener: -3928.09242304 hartree
nucrepener: 3467.75247650 hartree
electener: -7395.84489954 hartree
twoeener: 4935.14342047 hartree
kineticenergy: 3918.83262438 hartree
xcener: -198.389890129173 hartree
chargesum: -0.0000000
charge: -0.072769 -0.157334 -0.138964 -0.324819 -0.253177 -0.303483 0.366171 -0.103890 0.008112 -0.318265 -0.354395 -0.181134 -0.163482 0.030505 -0.122910 -0.123017 0.101800 0.058971 -0.218319 -0.198164 0.222148 -0.086223 -0.202393 0.419182 0.207324 -0.131958 -0.171555 -0.162917 -0.093711 -0.144837 0.110680 0.097160 0.082547 0.104913 0.103827 0.110281 0.044222 0.112112 0.114562 0.127151 0.080173 0.100449 0.134736 0.126975 0.154707 0.109076 0.125664 0.127054 0.130685 0.125607 0.136466 0.125881 0.128578
qa: -0.0728 -0.1573 -0.1390 -0.3248 -0.2532 -0.3035 0.3662 -0.1039 0.0081 -0.3183 -0.3544 -0.1811 -0.1635 0.0305 -0.1229 -0.1230 0.1018 0.0590 -0.2183 -0.1982 0.2221 -0.0862 -0.2024 0.4192 0.2073 -0.1320 -0.1716 -0.1629 -0.0937 -0.1448 0.1107 0.0972 0.0825 0.1049 0.1038 0.1103 0.0442 0.1121 0.1146 0.1272 0.0802 0.1004 0.1347 0.1270 0.1547 0.1091 0.1257 0.1271 0.1307 0.1256 0.1365 0.1259 0.1286
va: 1.1850 1.1333 1.1618 1.9751 2.1238 2.1039 3.6059 3.9677 3.6062 3.9359 3.9334 4.0811 3.9758 3.9530 4.0415 4.0193 3.9395 3.5877 3.9572 4.0290 3.8137 3.9357 4.0465 4.5754 3.8363 3.8592 4.0066 3.9028 3.9464 3.8871 0.9823 1.0059 1.0088 1.0025 1.0132 1.0163 1.0186 1.0071 1.0125 1.0004 0.9959 0.9880 1.0175 1.0123 1.0040 1.0092 0.9990 1.0113 1.0071 1.0130 0.9974 0.9981 1.0004
dispcorr: -0.031599794 hartree
energy: -3928.124022837255
dipole: -56.21952 55.46523 -0.75429 58.73447 -58.33617 0.39830 42.99136 -42.95639 0.03497
magnitude: 0.85370 au
magnitude: 2.16994 debye
