program: Orca
programVersion: 5.0.2
elementType: Br F F O O O C C C C C C C C C C C C C C C C C C C C C C C C H H H H H H H H H H H H H H H H H H H H H H H
charge: 0
multiplicity: 1
keywords: wb97x-d3
keywords: def2-TZVPP
keywords: def2/J RIJCOSX
keywords: DEFGRID2
keywords: scfconv7
keywords: smallprint printgap noloewdin
keywords: NOSOSCF
formula: C24H23BrF2O3
InChI: InChI=1/C24H23BrF2O3/c1-23(2,19-11-13-21(14-12-19)30-24(25,26)27)17-28-16-18-7-6-10-22(15-18)29-20-8-4-3-5-9-20/h3-15H,16-17H2,1-2H3
53 atoms
Br 1.508535 -0.236211 -2.597254
F  3.115282 -2.388972 -2.660179
F  3.148917 -1.341211 -0.790343
O  -4.027154 0.196469 -0.22937
O  1.477576 -2.706245 -1.321046
O  0.897119 3.30369 0.269845
C  -3.351084 -1.491652 1.449032
C  -3.710865 -0.029431 1.118764
C  -2.050777 -1.867213 0.75182
C  -4.5150 -2.394378 1.041161
C  -3.180603 -1.59038 2.970182
C  -0.854417 -1.251321 1.119067
C  -1.998511 -2.774756 -0.301425
C  -2.985443 0.623252 -1.077704
C  0.340663 -1.496384 0.463669
C  -0.818041 -3.025721 -0.983498
C  0.342646 -2.378007 -0.605425
C  -2.371559 1.932964 -0.653031
C  -1.015595 2.002703 -0.372532
C  -3.154128 3.078962 -0.529603
C  -0.442572 3.206579 0.020378
C  -2.573465 4.276751 -0.15036
C  -1.215306 4.349366 0.132863
C  2.345726 -1.793163 -1.761647
C  1.490504 2.35063 1.043804
C  0.910263 1.897987 2.224115
C  2.730912 1.875119 0.644321
C  1.585565 0.971528 3.003511
C  3.399469 0.955311 1.437775
C  2.830731 0.494871 2.615955
H  -4.605638 0.232945 1.693595
H  -2.912191 0.639426 1.465848
H  -4.306535 -3.441777 1.265785
H  -5.411268 -2.114682 1.59737
H  -4.757421 -2.310029 -0.017359
H  -2.901146 -2.602339 3.264118
H  -4.115016 -1.34224 3.477034
H  -2.416346 -0.913597 3.353913
H  -0.834454 -0.535611 1.930716
H  -2.892332 -3.286499 -0.628059
H  -2.196963 -0.129312 -1.183927
H  -3.448471 0.73506 -2.061013
H  1.237976 -0.994213 0.799927
H  -0.800175 -3.719165 -1.813782
H  -0.402741 1.113894 -0.464238
H  -4.215816 3.031205 -0.736288
H  -3.180879 5.168251 -0.065254
H  -0.756879 5.281723 0.434907
H  -0.054008 2.277634 2.53829
H  3.164804 2.228805 -0.281296
H  1.137193 0.626721 3.926343
H  4.368358 0.589981 1.125197
H  3.353126 -0.226801 3.228937
totalener: -3928.09015752 hartree
nucrepener: 3738.51292429 hartree
electener: -7666.60308181 hartree
twoeener: 5206.08664473 hartree
kineticenergy: 3918.83978834 hartree
xcener: -198.397143240259 hartree
chargesum: 0.0000000
charge: -0.072419 -0.139163 -0.151127 -0.325275 -0.251304 -0.301759 0.300037 -0.064991 -0.009336 -0.345784 -0.310015 -0.217362 -0.163169 0.105698 -0.126819 -0.098211 0.128308 -0.036169 -0.088062 -0.189572 0.189152 -0.095518 -0.177854 0.427996 0.281843 -0.173323 -0.229472 -0.142366 -0.095307 -0.129550 0.101950 0.086082 0.103856 0.090993 0.101922 0.105726 0.095093 0.089507 0.101830 0.119161 0.066637 0.103321 0.134345 0.125839 0.059496 0.119641 0.124964 0.127147 0.133313 0.127628 0.127949 0.128139 0.126349
qa: -0.0724 -0.1392 -0.1511 -0.3253 -0.2513 -0.3018 0.3000 -0.0650 -0.0093 -0.3458 -0.3100 -0.2174 -0.1632 0.1057 -0.1268 -0.0982 0.1283 -0.0362 -0.0881 -0.1896 0.1892 -0.0955 -0.1779 0.4280 0.2818 -0.1733 -0.2295 -0.1424 -0.0953 -0.1295 0.1020 0.0861 0.1039 0.0910 0.1019 0.1057 0.0951 0.0895 0.1018 0.1192 0.0666 0.1033 0.1343 0.1258 0.0595 0.1196 0.1250 0.1271 0.1333 0.1276 0.1279 0.1281 0.1263
va: 1.1797 1.1623 1.1294 1.9936 2.1414 2.1133 3.7009 3.9898 3.6012 3.9217 3.9354 3.9770 3.9791 3.8951 3.8818 4.0380 3.9011 3.6866 3.8548 4.0069 3.8364 3.9350 4.0052 4.5518 3.7543 3.8689 3.9842 3.8951 3.8662 3.8933 1.0090 0.9946 1.0004 1.0108 1.0149 1.0050 1.0082 1.0024 1.0189 1.0088 0.9852 0.9906 1.0142 1.0123 1.0228 1.0159 0.9987 1.0118 1.0064 1.0164 1.0018 1.0017 1.0007
dispcorr: -0.036980489 hartree
energy: -3928.127138011445
dipole: -53.54300 52.87875 -0.66425 5.54623 -5.68695 -0.14072 51.08541 -50.28547 0.79994
magnitude: 1.04925 au
magnitude: 2.66699 debye
