program: Orca
programVersion: 5.0.2
elementType: Br F F O O O C C C C C C C C C C C C C C C C C C C C C C C C H H H H H H H H H H H H H H H H H H H H H H H
charge: 0
multiplicity: 1
keywords: wb97x-d3
keywords: def2-TZVPP
keywords: def2/J RIJCOSX
keywords: DEFGRID2
keywords: scfconv7
keywords: smallprint printgap noloewdin
keywords: NOSOSCF
formula: C24H23BrF2O3
InChI: InChI=1/C24H23BrF2O3/c1-23(2,19-11-13-21(14-12-19)30-24(25,26)27)17-28-16-18-7-6-10-22(15-18)29-20-8-4-3-5-9-20/h3-15H,16-17H2,1-2H3
53 atoms
Br 2.488564 -1.728348 -2.311543
F  2.625282 -3.946397 -0.808362
F  4.031027 -2.434181 -0.22693
O  -3.520419 0.733914 0.25688
O  2.00301 -2.180389 0.390256
O  0.333853 3.588054 1.84762
C  -3.68283 -1.662972 0.474899
C  -4.042443 -0.418814 -0.347883
C  -2.168737 -1.850332 0.449321
C  -4.420603 -2.835633 -0.17444
C  -4.19853 -1.523601 1.911428
C  -1.32815 -1.065152 1.243279
C  -1.555879 -2.775645 -0.390449
C  -3.617648 1.891685 -0.532502
C  0.049282 -1.182287 1.182279
C  -0.175605 -2.9304 -0.450628
C  0.621314 -2.115116 0.332673
C  -2.860595 3.002734 0.138345
C  -1.58972 2.758447 0.652376
C  -3.411307 4.274215 0.245743
C  -0.884739 3.785617 1.261962
C  -2.695193 5.294731 0.856996
C  -1.428505 5.059807 1.365757
C  2.770996 -2.631427 -0.597746
C  1.271223 2.769309 1.283774
C  2.092576 2.069192 2.157963
C  1.463798 2.679336 -0.09009
C  3.117441 1.281776 1.653206
C  2.483996 1.876537 -0.579741
C  3.315053 1.175967 0.283627
H  -3.648983 -0.533844 -1.368771
H  -5.137324 -0.347264 -0.43248
H  -4.165587 -3.783021 0.302763
H  -5.498128 -2.698329 -0.071229
H  -4.211675 -2.929278 -1.241463
H  -3.987743 -2.428206 2.484668
H  -5.281157 -1.380369 1.909452
H  -3.764232 -0.684439 2.452495
H  -1.737006 -0.3397 1.931603
H  -2.148363 -3.421314 -1.023398
H  -3.197047 1.709196 -1.532177
H  -4.664791 2.18727 -0.681825
H  0.677724 -0.551836 1.799279
H  0.224863 -3.694223 -1.101089
H  -1.156094 1.768464 0.580246
H  -4.40473 4.467234 -0.140304
H  -3.127991 6.283135 0.941547
H  -0.867489 5.850834 1.847308
H  1.934759 2.150289 3.22635
H  0.837219 3.232844 -0.778024
H  3.759555 0.743379 2.338439
H  2.633102 1.811381 -1.649621
H  4.115185 0.561374 -0.106182
elementType: Br F O C H
totalener: -3928.11378643 hartree
nucrepener: 3567.77895999 hartree
electener: -7495.89274642 hartree
twoeener: 5036.81677991 hartree
cpcmener: -0.02093555 hartree
kineticenergy: 3918.77203105 hartree
xcener: -198.380544939648 hartree
chargesum: -0.0000000
charge: -0.084815 -0.157538 -0.150770 -0.360659 -0.249733 -0.328635 0.367691 -0.061645 -0.018351 -0.350643 -0.353813 -0.239716 -0.226346 0.080965 -0.196079 -0.130921 0.195120 -0.021957 -0.205385 -0.211767 0.283452 -0.114832 -0.254618 0.432286 0.313563 -0.271934 -0.202319 -0.121308 -0.121140 -0.189502 0.101773 0.099591 0.115942 0.104564 0.099147 0.107893 0.101087 0.100061 0.144230 0.143488 0.095648 0.088041 0.170959 0.143673 0.147636 0.139331 0.155758 0.143816 0.142514 0.152516 0.154232 0.149856 0.149593
qa: -0.0848 -0.1575 -0.1508 -0.3607 -0.2497 -0.3286 0.3677 -0.0616 -0.0184 -0.3506 -0.3538 -0.2397 -0.2263 0.0810 -0.1961 -0.1309 0.1951 -0.0220 -0.2054 -0.2118 0.2835 -0.1148 -0.2546 0.4323 0.3136 -0.2719 -0.2023 -0.1213 -0.1211 -0.1895 0.1018 0.0996 0.1159 0.1046 0.0991 0.1079 0.1011 0.1001 0.1442 0.1435 0.0956 0.0880 0.1710 0.1437 0.1476 0.1393 0.1558 0.1438 0.1425 0.1525 0.1542 0.1499 0.1496
va: 1.1705 1.1318 1.1427 1.9588 2.1241 2.0825 3.5685 3.9523 3.6550 3.9145 3.9353 4.0546 4.0616 3.8908 3.9782 3.9596 3.8345 3.7774 3.9011 3.9446 3.7025 3.9017 4.0029 4.5633 3.6434 3.9656 3.9183 3.8705 3.8584 3.8552 0.9973 0.9951 1.0003 1.0063 1.0006 1.0010 1.0026 1.0096 1.0078 1.0010 0.9891 0.9940 0.9921 1.0174 0.9999 1.0052 0.9896 1.0079 1.0101 0.9982 0.9914 0.9952 0.9996
dispcorr: -0.031770245 hartree
energy: -3928.145556676642
dipole: -69.73395 67.88668 -1.84727 29.77254 -29.85373 -0.08120 31.69210 -32.52913 -0.83702
magnitude: 2.02968 au
magnitude: 5.15904 debye
