program: Orca
programVersion: 5.0.2
elementType: Br F F O O O C C C C C C C C C C C C C C C C C C C C C C C C H H H H H H H H H H H H H H H H H H H H H H H
charge: 0
multiplicity: 1
keywords: wb97x-d3
keywords: def2-TZVPP
keywords: def2/J RIJCOSX
keywords: DEFGRID2
keywords: scfconv7
keywords: smallprint printgap noloewdin
keywords: NOSOSCF
formula: C24H23BrF2O3
InChI: InChI=1/C24H23BrF2O3/c1-23(2,19-11-13-21(14-12-19)30-24(25,26)27)17-28-16-18-7-6-10-22(15-18)29-20-8-4-3-5-9-20/h3-15H,16-17H2,1-2H3
53 atoms
Br 2.494225 -1.520839 1.272316
F  3.789344 -1.958676 -1.034613
F  2.605815 -3.626959 -0.388161
O  -3.336511 0.136765 1.353579
O  1.680079 -1.861975 -1.368912
O  0.305064 2.622173 -1.283798
C  -3.915415 -1.466228 -0.340398
C  -4.136549 -0.054124 0.210232
C  -2.429001 -1.650986 -0.625689
C  -4.717403 -1.588588 -1.640602
C  -4.455788 -2.491359 0.656212
C  -1.664997 -2.63921 -0.017247
C  -1.77149 -0.791529 -1.509359
C  -3.316052 1.462409 1.823983
C  -0.298557 -2.764878 -0.243962
C  -0.409502 -0.880214 -1.731975
C  0.325873 -1.859232 -1.082179
C  -2.666774 2.41582 0.85152
C  -1.427682 2.101561 0.299659
C  -3.314498 3.581172 0.458557
C  -0.860325 2.947167 -0.641442
C  -2.730488 4.42888 -0.472598
C  -1.499679 4.117094 -1.02842
C  2.611741 -2.291382 -0.516924
C  1.454677 2.382351 -0.588765
C  1.668502 2.814804 0.713762
C  2.458353 1.714476 -1.282796
C  2.896404 2.568578 1.315109
C  3.680295 1.48757 -0.671525
C  3.906628 1.910351 0.631415
H  -3.896814 0.68432 -0.565262
H  -5.200653 0.080245 0.455551
H  -4.401005 -0.865444 -2.393531
H  -4.608074 -2.584968 -2.071452
H  -5.781037 -1.424223 -1.454367
H  -4.364261 -3.510183 0.275385
H  -5.517506 -2.307161 0.830422
H  -3.954772 -2.450695 1.62391
H  -2.120677 -3.346519 0.66148
H  -2.318524 -0.012165 -2.024833
H  -4.327967 1.816614 2.062119
H  -2.755895 1.440519 2.762216
H  0.231303 -3.569224 0.24541
H  0.081015 -0.186565 -2.402681
H  -0.916605 1.190668 0.58884
H  -4.287432 3.819636 0.871335
H  -3.24106 5.333274 -0.777294
H  -1.044133 4.76427 -1.7673
H  0.901002 3.345521 1.262227
H  2.282865 1.388744 -2.300646
H  3.059318 2.906086 2.330772
H  4.45955 0.974926 -1.220132
H  4.858956 1.722735 1.109126
elementType: Br F O C H
totalener: -3928.11357847 hartree
nucrepener: 3679.67165939 hartree
electener: -7607.78523786 hartree
twoeener: 5149.22267839 hartree
cpcmener: -0.02159801 hartree
kineticenergy: 3918.77619087 hartree
xcener: -198.384061581359 hartree
chargesum: 0.0000000
charge: -0.076069 -0.152826 -0.160907 -0.367434 -0.258238 -0.329768 0.399600 -0.084075 -0.073967 -0.336220 -0.371597 -0.192422 -0.219047 0.067810 -0.139132 -0.215833 0.226144 -0.003640 -0.233485 -0.176005 0.286477 -0.129831 -0.231865 0.438403 0.335759 -0.212120 -0.279511 -0.141518 -0.118284 -0.193199 0.105274 0.105968 0.101343 0.107753 0.103835 0.106138 0.101993 0.100682 0.144383 0.138059 0.093817 0.109538 0.145383 0.152456 0.128759 0.140226 0.157321 0.145451 0.151768 0.149195 0.156750 0.148793 0.147916
qa: -0.0761 -0.1528 -0.1609 -0.3674 -0.2582 -0.3298 0.3996 -0.0841 -0.0740 -0.3362 -0.3716 -0.1924 -0.2190 0.0678 -0.1391 -0.2158 0.2261 -0.0036 -0.2335 -0.1760 0.2865 -0.1298 -0.2319 0.4384 0.3358 -0.2121 -0.2795 -0.1415 -0.1183 -0.1932 0.1053 0.1060 0.1013 0.1078 0.1038 0.1061 0.1020 0.1007 0.1444 0.1381 0.0938 0.1095 0.1454 0.1525 0.1288 0.1402 0.1573 0.1455 0.1518 0.1492 0.1567 0.1488 0.1479
va: 1.1730 1.1385 1.1278 1.9321 2.1192 2.0558 3.5370 3.9509 3.6691 3.9276 3.9293 4.0264 4.0111 3.8988 3.9680 3.9761 3.7710 3.6183 3.9421 3.9140 3.6414 3.8987 4.0407 4.5486 3.6637 3.9076 3.9254 3.8958 3.8405 3.8845 0.9842 1.0045 1.0022 1.0032 1.0026 0.9996 1.0065 1.0100 1.0000 1.0054 0.9986 0.9903 1.0176 1.0057 1.0172 1.0029 0.9895 1.0056 1.0002 1.0069 0.9893 0.9983 0.9941
dispcorr: -0.034286672 hartree
energy: -3928.147865139450
dipole: -69.50100 67.57174 -1.92926 28.35406 -27.64624 0.70783 -12.00293 12.30643 0.30350
magnitude: 2.07730 au
magnitude: 5.28008 debye
