program: Orca
programVersion: 5.0.2
elementType: Br F F O O O C C C C C C C C C C C C C C C C C C C C C C C C H H H H H H H H H H H H H H H H H H H H H H H
charge: 0
multiplicity: 1
keywords: wb97x-d3
keywords: def2-TZVPP
keywords: def2/J RIJCOSX
keywords: DEFGRID2
keywords: scfconv7
keywords: smallprint printgap noloewdin
keywords: NOSOSCF
formula: C24H23BrF2O3
InChI: InChI=1/C24H23BrF2O3/c1-23(2,19-11-13-21(14-12-19)30-24(25,26)27)17-28-16-18-7-6-10-22(15-18)29-20-8-4-3-5-9-20/h3-15H,16-17H2,1-2H3
53 atoms
Br 2.131962 -3.811194 0.212482
F  2.359623 -3.049697 2.781293
F  2.616064 -1.443346 1.384287
O  -3.887589 1.33822 -0.269418
O  0.597401 -2.228413 1.897261
O  1.446739 3.453294 0.517967
C  -3.30643 -0.410247 -1.832742
C  -3.410825 1.097993 -1.574456
C  -2.256745 -0.973587 -0.88373
C  -2.874972 -0.604839 -3.290547
C  -4.675659 -1.065251 -1.653767
C  -0.921781 -0.596924 -1.030342
C  -2.568054 -1.805315 0.187031
C  -3.393758 2.51443 0.334679
C  0.065047 -0.999168 -0.14715
C  -1.593302 -2.238407 1.075756
C  -0.286036 -1.824283 0.90911
C  -2.018549 2.309853 0.91796
C  -0.919626 2.991061 0.412381
C  -1.841216 1.404183 1.963715
C  0.345104 2.76369 0.947742
C  -0.581067 1.192918 2.495496
C  0.523058 1.864418 1.985622
C  1.873685 -2.524242 1.663768
C  1.658891 3.6525 -0.816586
C  1.344735 2.695532 -1.773743
C  2.262914 4.846674 -1.18647
C  1.623763 2.951822 -3.108126
C  2.54848 5.08341 -2.523053
C  2.222689 4.144072 -3.491141
H  -2.427463 1.558927 -1.730899
H  -4.091801 1.548788 -2.310607
H  -1.940446 -0.094663 -3.527304
H  -2.742747 -1.663493 -3.518959
H  -3.636071 -0.213976 -3.968676
H  -5.092102 -0.928472 -0.65613
H  -4.629587 -2.137947 -1.851264
H  -5.385537 -0.635123 -2.362948
H  -0.628161 0.053864 -1.843632
H  -3.584689 -2.133203 0.353803
H  -3.387766 3.355587 -0.369353
H  -4.098464 2.770236 1.12952
H  1.072134 -0.637234 -0.293794
H  -1.857986 -2.882012 1.905077
H  -1.055324 3.704221 -0.392785
H  -2.692239 0.868246 2.365814
H  -0.446622 0.491836 3.309066
H  1.511279 1.697246 2.395373
H  0.891065 1.755231 -1.488559
H  2.509989 5.582122 -0.431562
H  1.373769 2.205873 -3.851237
H  3.021043 6.014793 -2.807026
H  2.438199 4.336777 -4.533632
elementType: Br F O C H
totalener: -3928.11318716 hartree
nucrepener: 3588.20536494 hartree
electener: -7516.31855210 hartree
twoeener: 5056.83361348 hartree
cpcmener: -0.02428689 hartree
kineticenergy: 3918.80254487 hartree
xcener: -198.386311294324 hartree
chargesum: 0.0000000
charge: -0.078078 -0.148118 -0.158680 -0.377268 -0.262562 -0.331605 0.387140 -0.080271 -0.031102 -0.336506 -0.364704 -0.263032 -0.182655 0.059009 -0.126697 -0.173442 0.175264 0.077830 -0.219399 -0.294565 0.298930 -0.065942 -0.275338 0.423237 0.261341 -0.141195 -0.221648 -0.194506 -0.139664 -0.162349 0.095916 0.107603 0.100528 0.108513 0.103861 0.095922 0.112558 0.103956 0.147956 0.139233 0.099102 0.107395 0.153331 0.145926 0.141388 0.139456 0.152320 0.141669 0.136676 0.144319 0.154735 0.157321 0.156891
qa: -0.0781 -0.1481 -0.1587 -0.3773 -0.2626 -0.3316 0.3871 -0.0803 -0.0311 -0.3365 -0.3647 -0.2630 -0.1827 0.0590 -0.1267 -0.1734 0.1753 0.0778 -0.2194 -0.2946 0.2989 -0.0659 -0.2753 0.4232 0.2613 -0.1412 -0.2216 -0.1945 -0.1397 -0.1623 0.0959 0.1076 0.1005 0.1085 0.1039 0.0959 0.1126 0.1040 0.1480 0.1392 0.0991 0.1074 0.1533 0.1459 0.1414 0.1395 0.1523 0.1417 0.1367 0.1443 0.1547 0.1573 0.1569
va: 1.1789 1.1468 1.1273 1.9286 2.0910 2.0799 3.5673 3.9841 3.5878 3.9211 3.9174 4.0783 3.9650 3.9019 3.8698 4.0244 3.7029 3.5213 3.8966 3.9436 3.6617 3.7963 3.9885 4.5781 3.7148 3.8360 3.9777 3.9445 3.9030 3.8833 0.9847 1.0038 1.0013 1.0022 1.0042 1.0130 0.9990 1.0052 0.9934 0.9988 0.9962 0.9907 1.0101 1.0048 1.0081 1.0094 0.9925 1.0113 0.9964 1.0088 0.9934 0.9893 0.9905
dispcorr: -0.033947449 hartree
energy: -3928.147134607564
dipole: -57.28512 56.16314 -1.12198 62.81784 -62.13116 0.68667 -28.34162 26.92415 -1.41747
magnitude: 1.93380 au
magnitude: 4.91533 debye
