program: Orca
programVersion: 5.0.2
elementType: Br F F O O O C C C C C C C C C C C C C C C C C C C C C C C C H H H H H H H H H H H H H H H H H H H H H H H
charge: 0
multiplicity: 1
keywords: wb97x-d3
keywords: def2-TZVPP
keywords: def2/J RIJCOSX
keywords: DEFGRID2
keywords: scfconv7
keywords: smallprint printgap noloewdin
keywords: NOSOSCF
formula: C24H23BrF2O3
InChI: InChI=1/C24H23BrF2O3/c1-23(2,19-11-13-21(14-12-19)30-24(25,26)27)17-28-16-18-7-6-10-22(15-18)29-20-8-4-3-5-9-20/h3-15H,16-17H2,1-2H3
53 atoms
Br 2.428618 -3.362778 -0.993085
F  3.849693 -1.185337 -0.323287
F  2.51754 -0.86064 -1.976405
O  -4.303151 0.752912 -0.501287
O  1.779826 -0.903848 0.119885
O  0.414944 2.43462 -0.403881
C  -3.892991 -1.457912 0.365943
C  -4.472999 -0.06541 0.63285
C  -2.377518 -1.337638 0.24511
C  -4.534682 -2.059039 -0.88513
C  -4.268579 -2.345936 1.558353
C  -1.601885 -1.071409 1.376041
C  -1.708572 -1.436553 -0.969367
C  -4.405427 2.128721 -0.233856
C  -0.226735 -0.947889 1.304363
C  -0.328725 -1.290899 -1.071998
C  0.406749 -1.065176 0.077368
C  -3.122877 2.72013 0.296562
C  -1.903141 2.288676 -0.212256
C  -3.140211 3.726463 1.255841
C  -0.720363 2.872263 0.2151
C  -1.951225 4.30962 1.672939
C  -0.732769 3.897173 1.154612
C  2.621506 -1.425207 -0.766459
C  1.614772 2.329214 0.234709
C  1.745218 2.059757 1.591639
C  2.739413 2.425006 -0.576122
C  3.01461 1.890549 2.127932
C  3.999127 2.245651 -0.026992
C  4.145003 1.980101 1.32818
H  -5.542159 -0.155503 0.874099
H  -3.982831 0.370218 1.513817
H  -4.160225 -3.067168 -1.072607
H  -5.615042 -2.132764 -0.746725
H  -4.366259 -1.470106 -1.785956
H  -5.350927 -2.47958 1.604109
H  -3.957049 -1.925548 2.515369
H  -3.817329 -3.33487 1.466726
H  -2.066821 -0.961886 2.347167
H  -2.253536 -1.625161 -1.883611
H  -4.655591 2.612744 -1.182489
H  -5.231809 2.346359 0.454949
H  0.353878 -0.76601 2.199618
H  0.121747 -1.351723 -2.052017
H  -1.861287 1.506341 -0.960192
H  -4.081981 4.060268 1.674746
H  -1.969167 5.09979 2.412745
H  0.183007 4.374623 1.478514
H  0.87719 1.965748 2.230794
H  2.622252 2.630725 -1.632997
H  3.114289 1.67795 3.1847
H  4.870551 2.316551 -0.665204
H  5.129323 1.842042 1.755693
elementType: Br F O C H
totalener: -3928.11389782 hartree
nucrepener: 3645.23052804 hartree
electener: -7573.34442585 hartree
twoeener: 5115.27485867 hartree
cpcmener: -0.02337247 hartree
kineticenergy: 3918.78783595 hartree
xcener: -198.385154099777 hartree
chargesum: 0.0000000
charge: -0.078382 -0.150453 -0.165609 -0.369652 -0.257008 -0.322552 0.395820 -0.099655 -0.025878 -0.363371 -0.336122 -0.189861 -0.262297 0.071537 -0.231320 -0.105820 0.217221 0.049750 -0.315290 -0.211342 0.307320 -0.130700 -0.235904 0.442036 0.401644 -0.272987 -0.299606 -0.121961 -0.110759 -0.204691 0.104788 0.108353 0.115029 0.103492 0.093918 0.101383 0.102033 0.110288 0.140502 0.141389 0.104192 0.098337 0.146918 0.147341 0.143834 0.139449 0.157352 0.156252 0.153605 0.139687 0.156961 0.155069 0.155718
qa: -0.0784 -0.1505 -0.1656 -0.3697 -0.2570 -0.3226 0.3958 -0.0997 -0.0259 -0.3634 -0.3361 -0.1899 -0.2623 0.0715 -0.2313 -0.1058 0.2172 0.0498 -0.3153 -0.2113 0.3073 -0.1307 -0.2359 0.4420 0.4016 -0.2730 -0.2996 -0.1220 -0.1108 -0.2047 0.1048 0.1084 0.1150 0.1035 0.0939 0.1014 0.1020 0.1103 0.1405 0.1414 0.1042 0.0983 0.1469 0.1473 0.1438 0.1394 0.1574 0.1563 0.1536 0.1397 0.1570 0.1551 0.1557
va: 1.1793 1.1467 1.1228 1.9399 2.1285 2.0539 3.5568 3.9840 3.5961 3.9211 3.9165 3.9848 4.0581 3.8922 4.0100 3.9679 3.6874 3.6078 4.0273 3.9590 3.7189 3.8981 3.9361 4.5452 3.4597 3.8854 3.9942 3.8958 3.8446 3.9158 1.0017 0.9825 0.9992 1.0044 1.0131 1.0053 1.0024 1.0016 1.0030 1.0018 0.9895 0.9965 1.0025 1.0173 1.0177 1.0032 0.9905 0.9971 0.9998 1.0124 0.9898 0.9893 0.9910
dispcorr: -0.034353950 hartree
energy: -3928.148251765735
dipole: -67.76258 66.12490 -1.63768 44.29633 -43.96344 0.33289 24.07505 -22.80022 1.27483
magnitude: 2.10190 au
magnitude: 5.34262 debye
