program: Orca
programVersion: 5.0.2
elementType: Br F F O O O C C C C C C C C C C C C C C C C C C C C C C C C H H H H H H H H H H H H H H H H H H H H H H H
charge: 0
multiplicity: 1
keywords: wb97x-d3
keywords: def2-TZVPP
keywords: def2/J RIJCOSX
keywords: DEFGRID2
keywords: scfconv7
keywords: smallprint printgap noloewdin
keywords: NOSOSCF
formula: C24H23BrF2O3
InChI: InChI=1/C24H23BrF2O3/c1-23(2,19-11-13-21(14-12-19)30-24(25,26)27)17-28-16-18-7-6-10-22(15-18)29-20-8-4-3-5-9-20/h3-15H,16-17H2,1-2H3
53 atoms
Br 1.609786 -4.316722 0.270604
F  2.264792 -3.402021 2.70709
F  2.534987 -1.956757 1.146036
O  -3.777934 1.525796 -0.133784
O  0.518366 -2.411123 1.975554
O  1.851128 2.51535 -0.313245
C  -3.606283 -0.48608 -1.461037
C  -3.510305 1.0433 -1.431355
C  -2.509792 -1.050741 -0.565876
C  -3.394956 -0.938661 -2.910469
C  -5.005069 -0.924019 -1.029202
C  -1.169864 -0.841187 -0.895099
C  -2.773083 -1.74327 0.611659
C  -3.054588 2.682693 0.22936
C  -0.130862 -1.283267 -0.093879
C  -1.748416 -2.210101 1.42419
C  -0.434575 -1.973213 1.068866
C  -1.669955 2.342124 0.717063
C  -0.546887 2.6649 -0.034445
C  -1.518153 1.642162 1.91282
C  0.717558 2.301086 0.418945
C  -0.255502 1.288108 2.356297
C  0.871028 1.619267 1.615649
C  1.704111 -2.898199 1.614661
C  2.020692 3.650308 -1.053457
C  1.623663 4.904927 -0.60638
C  2.684632 3.508928 -2.264687
C  1.895595 6.018533 -1.388758
C  2.959281 4.632426 -3.030186
C  2.562846 5.890974 -2.599621
H  -2.515148 1.350624 -1.774785
H  -4.233078 1.467319 -2.142879
H  -2.435973 -0.615129 -3.316882
H  -3.438374 -2.025834 -2.988976
H  -4.175014 -0.530147 -3.556183
H  -5.260249 -0.615065 -0.015701
H  -5.115729 -2.008493 -1.084092
H  -5.75006 -0.488312 -1.697701
H  -0.906627 -0.299718 -1.794816
H  -3.790539 -1.936133 0.922482
H  -3.003925 3.400587 -0.597875
H  -3.621229 3.161538 1.031464
H  0.883718 -1.057852 -0.388248
H  -1.97714 -2.747729 2.335791
H  -0.665574 3.191827 -0.974257
H  -2.389711 1.380705 2.500731
H  -0.138919 0.752515 3.289642
H  1.860331 1.342907 1.958437
H  1.114423 5.022175 0.342091
H  2.991109 2.525061 -2.597865
H  1.587329 6.995835 -1.040177
H  3.483169 4.518543 -3.970574
H  2.775327 6.765488 -3.200318
elementType: Br F O C H
totalener: -3928.11366312 hartree
nucrepener: 3530.33083933 hartree
electener: -7458.44450245 hartree
twoeener: 4999.60175928 hartree
cpcmener: -0.02375004 hartree
kineticenergy: 3918.79180805 hartree
xcener: -198.383334625048 hartree
chargesum: 0.0000000
charge: -0.078353 -0.148195 -0.158201 -0.378749 -0.262307 -0.330662 0.398648 -0.081898 -0.051615 -0.335932 -0.367415 -0.250302 -0.181594 0.062319 -0.140223 -0.163481 0.173469 0.076379 -0.221994 -0.294491 0.318438 -0.064539 -0.291289 0.422766 0.302053 -0.205176 -0.262238 -0.142227 -0.116690 -0.189752 0.101966 0.107209 0.102196 0.107843 0.103360 0.095963 0.110755 0.103685 0.139974 0.140386 0.099219 0.107199 0.151562 0.146212 0.142885 0.138644 0.153151 0.138600 0.155110 0.143698 0.158378 0.157581 0.157675
qa: -0.0784 -0.1482 -0.1582 -0.3787 -0.2623 -0.3307 0.3986 -0.0819 -0.0516 -0.3359 -0.3674 -0.2503 -0.1816 0.0623 -0.1402 -0.1635 0.1735 0.0764 -0.2220 -0.2945 0.3184 -0.0645 -0.2913 0.4228 0.3021 -0.2052 -0.2622 -0.1422 -0.1167 -0.1898 0.1020 0.1072 0.1022 0.1078 0.1034 0.0960 0.1108 0.1037 0.1400 0.1404 0.0992 0.1072 0.1516 0.1462 0.1429 0.1386 0.1532 0.1386 0.1551 0.1437 0.1584 0.1576 0.1577
va: 1.1787 1.1461 1.1277 1.9272 2.0921 2.0662 3.5479 3.9653 3.5993 3.9195 3.9204 4.0738 3.9634 3.9055 3.9026 4.0234 3.7031 3.5186 3.8721 3.9525 3.6301 3.7888 3.9776 4.5797 3.6851 3.9123 4.0158 3.8887 3.8829 3.9084 0.9865 1.0045 1.0019 1.0026 1.0043 1.0130 0.9996 1.0053 1.0055 0.9987 0.9952 0.9912 1.0097 1.0048 1.0083 1.0090 0.9901 1.0139 0.9996 1.0099 0.9905 0.9893 0.9908
dispcorr: -0.032191278 hartree
energy: -3928.145854402632
dipole: -51.78477 50.67240 -1.11236 73.50597 -72.27217 1.23380 -23.91445 22.78755 -1.12690
magnitude: 2.00736 au
magnitude: 5.10231 debye
