program: Orca
programVersion: 5.0.2
elementType: Br F F O O O C C C C C C C C C C C C C C C C C C C C C C C C H H H H H H H H H H H H H H H H H H H H H H H
charge: 0
multiplicity: 1
keywords: wb97x-d3
keywords: def2-TZVPP
keywords: def2/J RIJCOSX
keywords: DEFGRID2
keywords: scfconv7
keywords: smallprint printgap noloewdin
keywords: NOSOSCF
formula: C24H23BrF2O3
InChI: InChI=1/C24H23BrF2O3/c1-23(2,19-11-13-21(14-12-19)30-24(25,26)27)17-28-16-18-7-6-10-22(15-18)29-20-8-4-3-5-9-20/h3-15H,16-17H2,1-2H3
53 atoms
Br 1.73654 -3.924024 -1.594158
F  3.260625 -3.223296 0.512161
F  2.65054 -1.566991 -0.703557
O  -4.072356 0.481222 1.231015
O  1.257537 -2.512356 0.751304
O  0.69569 1.846188 0.373685
C  -4.197904 -1.297184 -0.375781
C  -4.397652 0.196938 -0.109437
C  -2.742152 -1.653394 -0.098349
C  -4.524213 -1.556884 -1.850589
C  -5.174085 -2.102235 0.481754
C  -1.722602 -1.035843 -0.824376
C  -2.364005 -2.565785 0.881703
C  -4.008681 1.855572 1.52132
C  -0.38294 -1.294507 -0.585732
C  -1.029073 -2.854217 1.127354
C  -0.048186 -2.213721 0.395695
C  -2.823159 2.535867 0.882104
C  -1.569506 1.93689 0.94305
C  -2.965282 3.754601 0.229169
C  -0.478084 2.541528 0.336918
C  -1.862906 4.362479 -0.355628
C  -0.613757 3.761786 -0.316822
C  2.226178 -2.707643 -0.142248
C  1.893382 2.50795 0.311987
C  2.789854 2.138221 -0.678723
C  2.23003 3.472454 1.253675
C  4.041905 2.736586 -0.722274
C  3.481519 4.067634 1.194546
C  4.391406 3.70299 0.209982
H  -3.775982 0.781956 -0.799561
H  -5.442798 0.469711 -0.317121
H  -4.394531 -2.611851 -2.096832
H  -5.561011 -1.291691 -2.067597
H  -3.890776 -0.979007 -2.524938
H  -5.09582 -3.172344 0.281495
H  -6.198057 -1.804449 0.248686
H  -5.028213 -1.952078 1.551591
H  -1.961767 -0.312012 -1.593025
H  -3.106661 -3.07631 1.47886
H  -4.932363 2.369775 1.223876
H  -3.939002 1.933409 2.60953
H  0.362019 -0.762721 -1.159638
H  -0.756356 -3.571591 1.891164
H  -1.433983 0.989666 1.451571
H  -3.939072 4.225459 0.168906
H  -1.977333 5.30917 -0.867959
H  0.230584 4.236727 -0.800039
H  2.511818 1.387349 -1.407486
H  1.52772 3.75001 2.030298
H  4.7432 2.44639 -1.494041
H  3.748247 4.816066 1.929641
H  5.367305 4.169084 0.172045
elementType: Br F O C H
totalener: -3928.11539037 hartree
nucrepener: 3515.39866323 hartree
electener: -7443.51405360 hartree
twoeener: 4985.07903078 hartree
cpcmener: -0.02293231 hartree
kineticenergy: 3918.79630945 hartree
xcener: -198.381913821665 hartree
chargesum: -0.0000000
charge: -0.078314 -0.149369 -0.157956 -0.367479 -0.260436 -0.324923 0.401060 -0.088244 -0.073458 -0.334615 -0.371398 -0.214773 -0.168836 0.071306 -0.167353 -0.157308 0.166948 0.031449 -0.310457 -0.196781 0.300687 -0.141541 -0.207640 0.424354 0.243104 -0.227854 -0.170989 -0.133389 -0.149780 -0.169061 0.107508 0.107354 0.108217 0.103569 0.101627 0.108258 0.102524 0.099310 0.137081 0.143308 0.094587 0.107936 0.155345 0.146930 0.129376 0.139450 0.157510 0.152920 0.148621 0.157687 0.157765 0.157944 0.158220
qa: -0.0783 -0.1494 -0.1580 -0.3675 -0.2604 -0.3249 0.4011 -0.0882 -0.0735 -0.3346 -0.3714 -0.2148 -0.1688 0.0713 -0.1674 -0.1573 0.1669 0.0314 -0.3105 -0.1968 0.3007 -0.1415 -0.2076 0.4244 0.2431 -0.2279 -0.1710 -0.1334 -0.1498 -0.1691 0.1075 0.1074 0.1082 0.1036 0.1016 0.1083 0.1025 0.0993 0.1371 0.1433 0.0946 0.1079 0.1553 0.1469 0.1294 0.1395 0.1575 0.1529 0.1486 0.1577 0.1578 0.1579 0.1582
va: 1.1770 1.1452 1.1306 1.9334 2.1142 2.0495 3.5538 3.9507 3.6443 3.9220 3.9257 4.0328 3.9676 3.8923 3.9238 4.0425 3.7890 3.5701 4.0188 3.9297 3.7050 3.9206 3.9237 4.5707 3.7284 3.9811 3.9434 3.8888 3.9004 3.8928 0.9837 1.0044 1.0030 1.0035 1.0023 0.9993 1.0062 1.0109 1.0102 0.9977 0.9984 0.9901 1.0078 1.0051 1.0226 1.0035 0.9910 0.9998 1.0072 0.9960 0.9906 0.9902 0.9898
dispcorr: -0.030469931 hartree
energy: -3928.145860302753
dipole: -60.50201 59.05074 -1.45128 60.36160 -59.03016 1.33144 16.00202 -16.55190 -0.54988
magnitude: 2.04483 au
magnitude: 5.19753 debye
