program: Orca
programVersion: 5.0.2
elementType: Br F F O O O C C C C C C C C C C C C C C C C C C C C C C C C H H H H H H H H H H H H H H H H H H H H H H H
charge: 0
multiplicity: 1
keywords: wb97x-d3
keywords: def2-TZVPP
keywords: def2/J RIJCOSX
keywords: DEFGRID2
keywords: scfconv7
keywords: smallprint printgap noloewdin
keywords: NOSOSCF
formula: C24H23BrF2O3
InChI: InChI=1/C24H23BrF2O3/c1-23(2,19-11-13-21(14-12-19)30-24(25,26)27)17-28-16-18-7-6-10-22(15-18)29-20-8-4-3-5-9-20/h3-15H,16-17H2,1-2H3
53 atoms
Br 2.234095 -4.192621 0.128035
F  3.991147 -2.308161 0.895003
F  3.357086 -2.114613 -1.144466
O  -3.581239 1.176751 -0.12389
O  2.065404 -1.452088 0.54489
O  0.554749 3.712877 1.164728
C  -3.409955 -1.039782 -1.006569
C  -4.17836 -0.092622 -0.084579
C  -1.936429 -1.111575 -0.61817
C  -3.598306 -0.576865 -2.454498
C  -4.023588 -2.435882 -0.843755
C  -1.526488 -1.015638 0.712766
C  -0.946855 -1.337492 -1.571461
C  -4.05985 2.079927 0.838399
C  -0.195845 -1.142125 1.074131
C  0.394175 -1.463794 -1.234057
C  0.756122 -1.372644 0.097209
C  -3.069893 3.200102 0.993743
C  -1.707031 2.922368 0.978543
C  -3.500442 4.507993 1.19047
C  -0.792884 3.952554 1.139719
C  -2.575874 5.526021 1.375428
C  -1.215588 5.258773 1.34039
C  2.928281 -2.36174 0.101828
C  1.139939 2.935704 0.205489
C  2.313391 2.285627 0.568206
C  0.647541 2.829452 -1.090718
C  3.000636 1.534496 -0.373045
C  1.339798 2.062251 -2.016906
C  2.516409 1.414113 -1.668698
H  -5.225565 -0.050332 -0.417223
H  -4.200477 -0.47903 0.944053
H  -3.228023 -1.309999 -3.171703
H  -4.661069 -0.443111 -2.664929
H  -3.096866 0.370116 -2.65817
H  -5.084541 -2.429044 -1.104277
H  -3.932364 -2.79766 0.182232
H  -3.527812 -3.157401 -1.49493
H  -2.24494 -0.843777 1.503182
H  -1.202772 -1.420139 -2.618672
H  -5.044244 2.479808 0.560819
H  -4.190054 1.576251 1.807318
H  0.100117 -1.062953 2.112534
H  1.118315 -1.62053 -2.020474
H  -1.358061 1.906064 0.840542
H  -4.56015 4.732928 1.196438
H  -2.915519 6.54216 1.529302
H  -0.489171 6.051621 1.467017
H  2.687206 2.377938 1.580443
H  -0.260183 3.338594 -1.38789
H  3.916374 1.033999 -0.085555
H  0.95155 1.97806 -3.023922
H  3.049772 0.821666 -2.400139
elementType: Br F O C H
totalener: -3928.11468436 hartree
nucrepener: 3569.71994531 hartree
electener: -7497.83462967 hartree
twoeener: 5039.28143030 hartree
cpcmener: -0.02434549 hartree
kineticenergy: 3918.79384292 hartree
xcener: -198.382511811559 hartree
chargesum: -0.0000000
charge: -0.076752 -0.151447 -0.162537 -0.364384 -0.265872 -0.327965 0.349667 -0.051745 -0.030692 -0.375400 -0.325832 -0.240198 -0.173001 0.079653 -0.129236 -0.131800 0.124793 0.005184 -0.170584 -0.220620 0.244138 -0.119084 -0.240548 0.432504 0.295251 -0.239456 -0.177759 -0.126355 -0.171658 -0.181806 0.103500 0.103331 0.098569 0.100157 0.110833 0.103293 0.102320 0.104902 0.140840 0.144394 0.093507 0.092539 0.146771 0.151563 0.130884 0.138948 0.156542 0.144492 0.142276 0.151390 0.150979 0.157403 0.154110
qa: -0.0768 -0.1514 -0.1625 -0.3644 -0.2659 -0.3280 0.3497 -0.0517 -0.0307 -0.3754 -0.3258 -0.2402 -0.1730 0.0797 -0.1292 -0.1318 0.1248 0.0052 -0.1706 -0.2206 0.2441 -0.1191 -0.2405 0.4325 0.2953 -0.2395 -0.1778 -0.1264 -0.1717 -0.1818 0.1035 0.1033 0.0986 0.1002 0.1108 0.1033 0.1023 0.1049 0.1408 0.1444 0.0935 0.0925 0.1468 0.1516 0.1309 0.1389 0.1565 0.1445 0.1423 0.1514 0.1510 0.1574 0.1541
va: 1.1814 1.1441 1.1262 1.9496 2.0723 2.0809 3.5631 3.9176 3.6144 3.9322 3.9183 3.9700 3.9482 3.8854 3.9731 3.9202 3.7067 3.7180 3.8943 3.9603 3.7598 3.8964 4.0024 4.5657 3.6880 3.9674 3.8476 3.8378 3.8634 3.8231 0.9991 0.9932 1.0018 1.0053 1.0099 1.0036 1.0035 1.0037 0.9997 1.0000 0.9951 0.9896 1.0041 1.0131 1.0215 1.0061 0.9894 1.0069 1.0095 0.9993 0.9965 0.9919 0.9946
dispcorr: -0.032935926 hartree
energy: -3928.147620282126
dipole: -68.24497 65.89046 -2.35451 60.18376 -60.37387 -0.19010 -9.53424 9.34045 -0.19379
magnitude: 2.37011 au
magnitude: 6.02434 debye
