program: Orca
programVersion: 5.0.2
elementType: Br F F O O O C C C C C C C C C C C C C C C C C C C C C C C C H H H H H H H H H H H H H H H H H H H H H H H
charge: 0
multiplicity: 1
keywords: wb97x-d3
keywords: def2-TZVPP
keywords: def2/J RIJCOSX
keywords: DEFGRID2
keywords: scfconv7
keywords: smallprint printgap noloewdin
keywords: NOSOSCF
formula: C24H23BrF2O3
InChI: InChI=1/C24H23BrF2O3/c1-23(2,19-11-13-21(14-12-19)30-24(25,26)27)17-28-16-18-7-6-10-22(15-18)29-20-8-4-3-5-9-20/h3-15H,16-17H2,1-2H3
53 atoms
Br 2.52803 -3.775428 0.025949
F  2.877622 -1.407031 1.245569
F  4.023287 -1.619294 -0.555801
O  -3.752971 0.869898 0.03197
O  1.94628 -1.173902 -0.761236
O  0.518533 3.108808 1.474672
C  -3.744405 -1.445126 -0.557721
C  -4.272454 -0.048327 -0.894017
C  -2.220854 -1.396554 -0.558527
C  -4.245625 -2.412487 -1.63573
C  -4.31667 -1.894519 0.787139
C  -1.461651 -1.597047 0.588153
C  -1.529585 -1.107749 -1.737539
C  -3.981652 2.215861 -0.29023
C  -0.072158 -1.5317 0.579669
C  -0.148884 -1.051109 -1.775171
C  0.57455 -1.273682 -0.614222
C  -3.004894 3.079687 0.456792
C  -1.684974 2.663593 0.609672
C  -3.39931 4.313184 0.963811
C  -0.77361 3.495318 1.242796
C  -2.479811 5.131586 1.604492
C  -1.159798 4.73199 1.741267
C  2.827758 -1.837061 -0.021648
C  1.344318 2.680613 0.478274
C  1.074791 2.817382 -0.878056
C  2.547456 2.122321 0.901148
C  2.017945 2.385106 -1.803084
C  3.483502 1.713973 -0.033878
C  3.223731 1.837733 -1.393123
H  -3.978238 0.230364 -1.915571
H  -5.371602 -0.056982 -0.871996
H  -5.337218 -2.438074 -1.650288
H  -3.914059 -2.135233 -2.63709
H  -3.894627 -3.42683 -1.440206
H  -3.977197 -2.897243 1.052175
H  -5.40628 -1.926806 0.728477
H  -4.057427 -1.226584 1.608931
H  -1.940256 -1.80706 1.53454
H  -2.069142 -0.925471 -2.658556
H  -3.847599 2.379564 -1.36892
H  -5.010954 2.516718 -0.055051
H  0.457226 -1.675866 1.510541
H  0.367981 -0.839165 -2.702656
H  -1.370306 1.696437 0.235289
H  -4.429562 4.633109 0.864288
H  -2.792527 6.088052 2.003418
H  -0.436288 5.363493 2.241642
H  0.151755 3.260037 -1.227862
H  2.748716 2.026119 1.961322
H  1.800851 2.489975 -2.858546
H  4.42177 1.294657 0.305845
H  3.952023 1.508702 -2.122346
elementType: Br F O C H
totalener: -3928.11430015 hartree
nucrepener: 3581.60767386 hartree
electener: -7509.72197401 hartree
twoeener: 5051.38346094 hartree
cpcmener: -0.02410918 hartree
kineticenergy: 3918.79198065 hartree
xcener: -198.382713810932 hartree
chargesum: -0.0000000
charge: -0.079700 -0.162847 -0.151492 -0.363355 -0.254350 -0.322699 0.391283 -0.077870 -0.115734 -0.330672 -0.369832 -0.193653 -0.140657 0.091936 -0.111777 -0.248041 0.212072 0.016322 -0.211922 -0.219813 0.284010 -0.117266 -0.246486 0.438756 0.338769 -0.219336 -0.257489 -0.170851 -0.129188 -0.182809 0.104152 0.102903 0.102874 0.100862 0.108929 0.110097 0.102643 0.097477 0.143347 0.139449 0.089610 0.090469 0.145761 0.145305 0.121249 0.138597 0.156095 0.144256 0.156708 0.141152 0.156039 0.154048 0.152670
qa: -0.0797 -0.1628 -0.1515 -0.3634 -0.2543 -0.3227 0.3913 -0.0779 -0.1157 -0.3307 -0.3698 -0.1937 -0.1407 0.0919 -0.1118 -0.2480 0.2121 0.0163 -0.2119 -0.2198 0.2840 -0.1173 -0.2465 0.4388 0.3388 -0.2193 -0.2575 -0.1709 -0.1292 -0.1828 0.1042 0.1029 0.1029 0.1009 0.1089 0.1101 0.1026 0.0975 0.1433 0.1394 0.0896 0.0905 0.1458 0.1453 0.1212 0.1386 0.1561 0.1443 0.1567 0.1412 0.1560 0.1540 0.1527
va: 1.1790 1.1274 1.1454 1.9402 2.1163 2.0889 3.5712 3.9506 3.7106 3.9214 3.9240 3.9930 3.9557 3.8879 3.9586 4.0477 3.7001 3.7084 3.9447 3.9608 3.7008 3.8921 4.0151 4.5540 3.6494 3.8552 3.9605 3.8820 3.8167 3.8632 0.9940 0.9983 1.0036 1.0032 1.0025 0.9996 1.0060 1.0116 0.9987 1.0033 0.9900 0.9946 1.0173 1.0078 1.0189 1.0064 0.9896 1.0068 0.9973 1.0110 0.9913 0.9952 0.9933
dispcorr: -0.032178594 hartree
energy: -3928.146478746658
dipole: -71.34721 69.17833 -2.16889 51.52441 -51.29951 0.22489 -7.70947 6.54998 -1.15949
magnitude: 2.46963 au
magnitude: 6.27730 debye
