program: Orca
programVersion: 5.0.2
elementType: Br F F O O O C C C C C C C C C C C C C C C C C C C C C C C C H H H H H H H H H H H H H H H H H H H H H H H
charge: 0
multiplicity: 1
keywords: wb97x-d3
keywords: def2-TZVPP
keywords: def2/J RIJCOSX
keywords: DEFGRID2
keywords: scfconv7
keywords: smallprint printgap noloewdin
keywords: NOSOSCF
formula: C24H23BrF2O3
InChI: InChI=1/C24H23BrF2O3/c1-23(2,19-11-13-21(14-12-19)30-24(25,26)27)17-28-16-18-7-6-10-22(15-18)29-20-8-4-3-5-9-20/h3-15H,16-17H2,1-2H3
53 atoms
Br 4.16253 -2.662425 -1.03254
F  1.912457 -3.825398 -0.136788
F  2.575736 -2.192376 1.075291
O  -3.885621 0.842581 0.235682
O  1.654982 -1.756404 -0.906081
O  0.235626 3.445971 1.545455
C  -3.975603 -1.559723 0.057686
C  -4.478582 -0.211242 -0.47502
C  -2.469751 -1.649695 -0.170973
C  -4.739183 -2.641647 -0.709159
C  -4.320709 -1.709823 1.543224
C  -1.569349 -1.020443 0.691754
C  -1.93624 -2.316554 -1.272873
C  -4.125848 2.116813 -0.3016
C  -0.200384 -1.048493 0.471777
C  -0.568609 -2.373542 -1.500139
C  0.286853 -1.73583 -0.624522
C  -3.231468 3.111937 0.383557
C  -1.896849 2.79335 0.621461
C  -3.718589 4.355743 0.767664
C  -1.06373 3.723656 1.225369
C  -2.875654 5.277483 1.373655
C  -1.54451 4.970775 1.603201
C  2.421927 -2.590317 -0.195859
C  1.054748 2.745858 0.706764
C  2.079248 2.02505 1.309865
C  0.944705 2.787373 -0.678159
C  2.998023 1.347329 0.522892
C  1.864762 2.092727 -1.451715
C  2.895426 1.375555 -0.861307
H  -4.24451 -0.134648 -1.547163
H  -5.574427 -0.17466 -0.382508
H  -4.66623 -2.527293 -1.791901
H  -4.382284 -3.640083 -0.452065
H  -5.799474 -2.597773 -0.455349
H  -3.989972 -2.679089 1.920743
H  -5.402253 -1.653776 1.682413
H  -3.876869 -0.942331 2.175288
H  -1.922529 -0.489033 1.563608
H  -2.582099 -2.817501 -1.980429
H  -3.919744 2.123204 -1.381891
H  -5.177228 2.410986 -0.18186
H  0.463238 -0.522408 1.145469
H  -0.179121 -2.901021 -2.36154
H  -1.512117 1.821547 0.337743
H  -4.759498 4.604078 0.600124
H  -3.258859 6.243925 1.674545
H  -0.883849 5.684331 2.079421
H  2.157473 2.003501 2.389895
H  0.160994 3.356989 -1.160789
H  3.798489 0.795759 0.998944
H  1.776277 2.126589 -2.53003
H  3.611606 0.845941 -1.474991
elementType: Br F O C H
totalener: -3928.11294171 hartree
nucrepener: 3521.35357247 hartree
electener: -7449.46651419 hartree
twoeener: 4990.77060030 hartree
cpcmener: -0.02165629 hartree
kineticenergy: 3918.79552662 hartree
xcener: -198.379637502470 hartree
chargesum: -0.0000000
charge: -0.044182 -0.159430 -0.164933 -0.360045 -0.292750 -0.325819 0.366689 -0.064508 -0.003137 -0.349237 -0.355351 -0.257364 -0.195640 0.077779 -0.163493 -0.172251 0.199499 -0.014836 -0.213591 -0.211803 0.287812 -0.116008 -0.255214 0.428321 0.329522 -0.282569 -0.207586 -0.099903 -0.148159 -0.188116 0.103670 0.099713 0.098341 0.117462 0.104786 0.109245 0.100448 0.099695 0.146462 0.145582 0.094630 0.088913 0.161438 0.147891 0.152659 0.138657 0.155753 0.143984 0.141688 0.153686 0.148065 0.156636 0.146896
qa: -0.0442 -0.1594 -0.1649 -0.3600 -0.2928 -0.3258 0.3667 -0.0645 -0.0031 -0.3492 -0.3554 -0.2574 -0.1956 0.0778 -0.1635 -0.1723 0.1995 -0.0148 -0.2136 -0.2118 0.2878 -0.1160 -0.2552 0.4283 0.3295 -0.2826 -0.2076 -0.0999 -0.1482 -0.1881 0.1037 0.0997 0.0983 0.1175 0.1048 0.1092 0.1004 0.0997 0.1465 0.1456 0.0946 0.0889 0.1614 0.1479 0.1527 0.1387 0.1558 0.1440 0.1417 0.1537 0.1481 0.1566 0.1469
va: 1.1856 1.1355 1.1299 1.9603 2.0824 2.0868 3.5657 3.9583 3.6127 3.9131 3.9326 4.0290 3.9787 3.8951 4.0029 4.0932 3.7035 3.7644 3.9053 3.9455 3.7014 3.8997 4.0063 4.5436 3.6396 3.9699 3.8833 3.8237 3.8947 3.8567 0.9973 0.9950 1.0013 1.0000 1.0059 1.0005 1.0033 1.0102 1.0082 0.9966 0.9890 0.9937 0.9961 1.0038 0.9936 1.0058 0.9896 1.0080 1.0112 0.9976 0.9962 0.9913 0.9969
dispcorr: -0.031725034 hartree
energy: -3928.144666747294
dipole: -89.83353 87.83441 -1.99912 41.40532 -41.28456 0.12077 9.83694 -10.86656 -1.02962
magnitude: 2.25193 au
magnitude: 5.72396 debye
