program: Orca
programVersion: 5.0.2
elementType: Br F F O O O C C C C C C C C C C C C C C C C C C C C C C C C H H H H H H H H H H H H H H H H H H H H H H H
charge: 0
multiplicity: 1
keywords: wb97x-d3
keywords: def2-TZVPP
keywords: def2/J RIJCOSX
keywords: DEFGRID2
keywords: scfconv7
keywords: smallprint printgap noloewdin
keywords: NOSOSCF
formula: C24H23BrF2O3
InChI: InChI=1/C24H23BrF2O3/c1-23(2,19-11-13-21(14-12-19)30-24(25,26)27)17-28-16-18-7-6-10-22(15-18)29-20-8-4-3-5-9-20/h3-15H,16-17H2,1-2H3
53 atoms
Br 1.873378 -3.721037 1.235812
F  1.970531 -1.200329 2.168885
F  3.597292 -1.696754 0.858973
O  -3.604117 1.554755 -1.180069
O  1.716409 -1.261154 -0.040208
O  1.432268 1.903436 0.388692
C  -3.818739 -0.843809 -1.32193
C  -4.29273 0.446804 -0.644789
C  -2.343547 -1.02827 -0.990815
C  -4.080403 -0.764983 -2.826048
C  -4.646485 -2.003487 -0.757578
C  -1.950802 -1.259068 0.327043
C  -1.334891 -0.912856 -1.942418
C  -3.391427 2.6131 -0.272278
C  -0.620192 -1.355855 0.701421
C  0.003852 -1.019718 -1.59636
C  0.354263 -1.234745 -0.276475
C  -2.20854 2.359768 0.627378
C  -0.93709 2.265836 0.064243
C  -2.366271 2.185928 1.996773
C  0.162851 2.033943 0.876255
C  -1.25985 1.934016 2.799106
C  0.00778 1.864155 2.247442
C  2.286078 -1.817259 1.022961
C  1.842554 2.618981 -0.70162
C  2.661256 1.968141 -1.614442
C  1.520648 3.960773 -0.872353
C  3.150244 2.663366 -2.711425
C  2.007984 4.639471 -1.979497
C  2.820305 3.997367 -2.904784
H  -5.374543 0.56671 -0.799301
H  -4.135707 0.36439 0.437607
H  -3.76948 -1.681559 -3.330938
H  -5.149669 -0.640834 -3.007571
H  -3.572101 0.068627 -3.310066
H  -4.325881 -2.954229 -1.186095
H  -5.702871 -1.87224 -1.00048
H  -4.572311 -2.087154 0.327338
H  -2.692411 -1.34583 1.110663
H  -1.573383 -0.73305 -2.98134
H  -3.211336 3.50528 -0.877016
H  -4.286479 2.811607 0.329683
H  -0.390361 -1.501642 1.746368
H  0.772136 -0.924492 -2.353319
H  -0.816999 2.381212 -1.00675
H  -3.352684 2.252195 2.43949
H  -1.38448 1.797809 3.865689
H  0.874041 1.679974 2.870373
H  2.918074 0.927216 -1.463964
H  0.899458 4.478288 -0.152232
H  3.78721 2.151991 -3.421627
H  1.754155 5.683346 -2.112199
H  3.197257 4.534307 -3.76523
elementType: Br F O C H
totalener: -3928.11403184 hartree
nucrepener: 3652.97207712 hartree
electener: -7581.08610896 hartree
twoeener: 5122.86741587 hartree
cpcmener: -0.02330234 hartree
kineticenergy: 3918.79768765 hartree
xcener: -198.385890139276 hartree
chargesum: 0.0000000
charge: -0.080804 -0.157905 -0.150175 -0.378358 -0.254863 -0.328499 0.397082 -0.086430 -0.050564 -0.366799 -0.336469 -0.280878 -0.162222 0.061961 -0.130865 -0.225998 0.254046 0.055974 -0.255382 -0.221354 0.330566 -0.100315 -0.289110 0.426559 0.319162 -0.277288 -0.206900 -0.113405 -0.144266 -0.191711 0.106743 0.102689 0.111697 0.102930 0.095800 0.108053 0.103111 0.101665 0.138294 0.140514 0.107422 0.099374 0.143449 0.143702 0.134659 0.139689 0.155335 0.139166 0.143871 0.153711 0.158342 0.157961 0.157034
qa: -0.0808 -0.1579 -0.1502 -0.3784 -0.2549 -0.3285 0.3971 -0.0864 -0.0506 -0.3668 -0.3365 -0.2809 -0.1622 0.0620 -0.1309 -0.2260 0.2540 0.0560 -0.2554 -0.2214 0.3306 -0.1003 -0.2891 0.4266 0.3192 -0.2773 -0.2069 -0.1134 -0.1443 -0.1917 0.1067 0.1027 0.1117 0.1029 0.0958 0.1081 0.1031 0.1017 0.1383 0.1405 0.1074 0.0994 0.1434 0.1437 0.1347 0.1397 0.1553 0.1392 0.1439 0.1537 0.1583 0.1580 0.1570
va: 1.1768 1.1298 1.1450 1.9271 2.1203 2.0407 3.5469 3.9827 3.6228 3.9197 3.9196 4.1186 3.9503 3.9038 3.9177 4.0194 3.6113 3.5774 3.9194 3.9007 3.5528 3.8698 3.9927 4.5688 3.6817 3.9736 3.9311 3.8925 3.8957 3.9182 1.0036 0.9857 0.9994 1.0054 1.0129 1.0023 1.0041 1.0020 1.0072 0.9989 0.9912 0.9940 1.0179 1.0057 1.0180 1.0048 0.9886 1.0154 1.0211 0.9990 0.9903 0.9905 0.9908
dispcorr: -0.034650229 hartree
energy: -3928.148682068250
dipole: -60.41623 58.55586 -1.86037 55.91156 -55.33879 0.57277 -30.75593 30.65021 -0.10572
magnitude: 1.94941 au
magnitude: 4.95502 debye
