program: Orca
programVersion: 5.0.2
elementType: Br F F O O O C C C C C C C C C C C C C C C C C C C C C C C C H H H H H H H H H H H H H H H H H H H H H H H
charge: 0
multiplicity: 1
keywords: wb97x-d3
keywords: def2-TZVPP
keywords: def2/J RIJCOSX
keywords: DEFGRID2
keywords: scfconv7
keywords: smallprint printgap noloewdin
keywords: NOSOSCF
formula: C24H23BrF2O3
InChI: InChI=1/C24H23BrF2O3/c1-23(2,19-11-13-21(14-12-19)30-24(25,26)27)17-28-16-18-7-6-10-22(15-18)29-20-8-4-3-5-9-20/h3-15H,16-17H2,1-2H3
53 atoms
Br 2.574622 -3.760977 -0.190547
F  2.894805 -1.615324 1.40279
F  4.02772 -1.518573 -0.417572
O  -3.583414 0.671265 1.343498
O  1.941371 -1.077905 -0.533334
O  0.171683 3.127956 -1.125039
C  -3.743542 -1.222796 -0.114232
C  -4.173261 0.223997 0.14534
C  -2.221955 -1.251104 -0.203981
C  -4.377835 -1.671148 -1.43473
C  -4.282141 -2.125919 0.996649
C  -1.566273 -0.698101 -1.306092
C  -1.425447 -1.753089 0.818335
C  -3.784091 2.032178 1.614091
C  -0.185964 -0.667462 -1.392122
C  -0.036684 -1.719149 0.764363
C  0.574692 -1.18274 -0.354071
C  -3.002165 2.95537 0.711618
C  -1.742484 2.588626 0.24601
C  -3.529961 4.193306 0.36132
C  -1.025635 3.466164 -0.555454
C  -2.800528 5.065791 -0.43284
C  -1.543042 4.709536 -0.893022
C  2.840414 -1.837274 0.083334
C  1.240079 2.675836 -0.410967
C  2.321799 2.248723 -1.176361
C  1.316595 2.664617 0.976238
C  3.474217 1.803002 -0.55268
C  2.47649 2.200194 1.58582
C  3.557096 1.766277 0.833689
H  -3.875431 0.853694 -0.703759
H  -5.269908 0.27745 0.21386
H  -4.080925 -2.69148 -1.682088
H  -5.466813 -1.654001 -1.35796
H  -4.105123 -1.032653 -2.275466
H  -3.953723 -1.830616 1.992689
H  -3.985407 -3.165003 0.842375
H  -5.37334 -2.095219 0.996841
H  -2.132509 -0.274084 -2.125244
H  -1.873094 -2.18377 1.702781
H  -4.849341 2.296355 1.570421
H  -3.464892 2.186383 2.648943
H  0.298611 -0.243668 -2.262552
H  0.517603 -2.104297 1.607822
H  -1.329808 1.618688 0.496527
H  -4.518272 4.473652 0.705891
H  -3.216271 6.027748 -0.703851
H  -0.972491 5.379396 -1.523999
H  2.254453 2.272022 -2.257186
H  0.497497 3.013723 1.590415
H  4.310125 1.476642 -1.157819
H  2.528606 2.186643 2.667037
H  4.454743 1.408721 1.320441
elementType: Br F O C H
totalener: -3928.11381677 hartree
nucrepener: 3610.68317251 hartree
electener: -7538.79698927 hartree
twoeener: 5080.31773161 hartree
cpcmener: -0.02209000 hartree
kineticenergy: 3918.78732903 hartree
xcener: -198.385088808192 hartree
chargesum: 0.0000000
charge: -0.080560 -0.163358 -0.151339 -0.365470 -0.253466 -0.321840 0.389616 -0.106469 -0.052931 -0.335112 -0.360870 -0.198999 -0.216528 0.061640 -0.238337 -0.129389 0.244038 0.042142 -0.298405 -0.223457 0.346458 -0.109628 -0.259647 0.444056 0.347438 -0.284800 -0.222639 -0.115170 -0.145085 -0.202829 0.112169 0.108441 0.108940 0.103137 0.101269 0.093838 0.114751 0.102212 0.141398 0.143285 0.096054 0.105431 0.148421 0.141846 0.139959 0.139353 0.156900 0.142967 0.137486 0.157589 0.153597 0.156853 0.155041
qa: -0.0806 -0.1634 -0.1513 -0.3655 -0.2535 -0.3218 0.3896 -0.1065 -0.0529 -0.3351 -0.3609 -0.1990 -0.2165 0.0616 -0.2383 -0.1294 0.2440 0.0421 -0.2984 -0.2235 0.3465 -0.1096 -0.2596 0.4441 0.3474 -0.2848 -0.2226 -0.1152 -0.1451 -0.2028 0.1122 0.1084 0.1089 0.1031 0.1013 0.0938 0.1148 0.1022 0.1414 0.1433 0.0961 0.1054 0.1484 0.1418 0.1400 0.1394 0.1569 0.1430 0.1375 0.1576 0.1536 0.1569 0.1550
va: 1.1781 1.1269 1.1447 1.9381 2.1346 2.0684 3.5731 3.9664 3.6339 3.9179 3.9171 3.9524 4.0787 3.9062 4.0036 4.0036 3.6910 3.5907 3.9604 3.9651 3.6070 3.8786 4.0415 4.5447 3.6149 3.9427 3.8845 3.8225 3.8968 3.8561 0.9818 1.0038 1.0019 1.0037 1.0033 1.0131 0.9995 1.0050 1.0041 0.9988 0.9980 0.9890 1.0044 1.0198 1.0069 1.0023 0.9893 1.0079 1.0137 0.9978 0.9934 0.9905 0.9923
dispcorr: -0.033680572 hartree
energy: -3928.147497339465
dipole: -71.46692 69.41220 -2.05472 53.19861 -52.72826 0.47034 2.91632 -2.81761 0.09871
magnitude: 2.11017 au
magnitude: 5.36363 debye
