program: Orca
programVersion: 5.0.2
elementType: Br F F O O O C C C C C C C C C C C C C C C C C C C C C C C C H H H H H H H H H H H H H H H H H H H H H H H
charge: 0
multiplicity: 1
keywords: wb97x-d3
keywords: def2-TZVPP
keywords: def2/J RIJCOSX
keywords: DEFGRID2
keywords: scfconv7
keywords: smallprint printgap noloewdin
keywords: NOSOSCF
formula: C24H23BrF2O3
InChI: InChI=1/C24H23BrF2O3/c1-23(2,19-11-13-21(14-12-19)30-24(25,26)27)17-28-16-18-7-6-10-22(15-18)29-20-8-4-3-5-9-20/h3-15H,16-17H2,1-2H3
53 atoms
Br 2.322106 -0.760579 -1.796462
F  1.977388 -3.411162 -1.712258
F  3.860631 -2.776035 -0.895606
O  -3.228661 0.383786 -0.198941
O  2.123274 -2.540252 0.329183
O  0.950241 3.372798 -0.263274
C  -3.13984 -0.919461 1.810006
C  -3.392641 0.460589 1.19753
C  -1.749897 -1.390516 1.398737
C  -4.241962 -1.87977 1.36423
C  -3.213815 -0.773269 3.333894
C  -1.531943 -2.56505 0.685977
C  -0.632298 -0.622836 1.733381
C  -3.572285 1.560335 -0.880608
C  -0.255436 -2.965228 0.308655
C  0.645783 -0.99343 1.355278
C  0.820301 -2.163813 0.637321
C  -2.626909 2.711049 -0.637934
C  -1.257641 2.493339 -0.518757
C  -3.117537 4.010996 -0.571727
C  -0.406343 3.572304 -0.334038
C  -2.253801 5.083221 -0.402002
C  -0.889366 4.870206 -0.273048
C  2.563328 -2.496288 -0.929648
C  1.492919 2.815577 0.856227
C  2.799392 2.352072 0.738426
C  0.824922 2.73092 2.071904
C  3.43408 1.801112 1.838996
C  1.475334 2.1725 3.165696
C  2.77639 1.704287 3.05956
H  -4.412549 0.786527 1.449403
H  -2.708451 1.199793 1.634863
H  -4.129547 -2.863116 1.82411
H  -5.213709 -1.489275 1.672171
H  -4.274453 -2.018506 0.283346
H  -3.054812 -1.734314 3.8253
H  -4.196954 -0.406373 3.636825
H  -2.470211 -0.075282 3.721139
H  -2.359103 -3.204412 0.411035
H  -0.749025 0.293745 2.297324
H  -3.568285 1.307687 -1.944656
H  -4.595557 1.874969 -0.634239
H  -0.122126 -3.898862 -0.220884
H  1.496387 -0.378076 1.620904
H  -0.849637 1.489919 -0.573063
H  -4.183602 4.186331 -0.655287
H  -2.645295 6.09115 -0.355488
H  -0.20732 5.69882 -0.130308
H  3.311938 2.426979 -0.21237
H  -0.188227 3.096185 2.182192
H  4.449156 1.438849 1.737803
H  0.950751 2.108925 4.110647
H  3.272874 1.268193 3.916297
elementType: Br F O C H
totalener: -3928.11637231 hartree
nucrepener: 3643.07957902 hartree
electener: -7571.19595133 hartree
twoeener: 5112.30994446 hartree
cpcmener: -0.02251066 hartree
kineticenergy: 3918.79222030 hartree
xcener: -198.382785890281 hartree
chargesum: -0.0000000
charge: -0.078443 -0.159516 -0.150844 -0.367860 -0.272678 -0.329378 0.388195 -0.079117 -0.025238 -0.372132 -0.333470 -0.201670 -0.260224 0.067483 -0.094803 -0.070105 0.071619 0.030313 -0.225226 -0.192996 0.241968 -0.133062 -0.207016 0.435289 0.342743 -0.265919 -0.244909 -0.098161 -0.139630 -0.198941 0.109408 0.103622 0.106939 0.102175 0.099799 0.109126 0.103257 0.101659 0.143904 0.142603 0.106703 0.094417 0.145925 0.126610 0.133406 0.140725 0.157376 0.146590 0.135640 0.151308 0.153242 0.156645 0.152647
qa: -0.0784 -0.1595 -0.1508 -0.3679 -0.2727 -0.3294 0.3882 -0.0791 -0.0252 -0.3721 -0.3335 -0.2017 -0.2602 0.0675 -0.0948 -0.0701 0.0716 0.0303 -0.2252 -0.1930 0.2420 -0.1331 -0.2070 0.4353 0.3427 -0.2659 -0.2449 -0.0982 -0.1396 -0.1989 0.1094 0.1036 0.1069 0.1022 0.0998 0.1091 0.1033 0.1017 0.1439 0.1426 0.1067 0.0944 0.1459 0.1266 0.1334 0.1407 0.1574 0.1466 0.1356 0.1513 0.1532 0.1566 0.1526
va: 1.1790 1.1308 1.1452 1.9304 2.1053 2.0739 3.5743 3.9295 3.6448 3.9290 3.9282 3.9724 3.9958 3.8882 3.9865 3.9147 3.9274 3.5613 3.9911 3.9385 3.7248 3.8937 4.0027 4.5517 3.6265 3.9749 3.8401 3.8486 3.8463 3.8776 1.0025 0.9853 0.9997 1.0064 1.0109 1.0033 1.0029 1.0010 0.9992 0.9983 0.9896 0.9998 1.0100 1.0169 1.0169 1.0024 0.9897 1.0038 1.0142 1.0052 0.9905 0.9925 0.9927
dispcorr: -0.033475872 hartree
energy: -3928.149848182452
dipole: -62.74065 60.62101 -2.11965 26.36732 -25.54843 0.81889 44.95192 -43.68502 1.26689
magnitude: 2.60163 au
magnitude: 6.61283 debye
