program: Gaussian 09
title: 000072150
version: EM64L-G09RevD.01
frameworkgroup: C1[X(C5H7NO4S)]
method: RPBEPBE
basis: SDD
operation: Freq
keyword: #p
keyword: freq=noraman
keyword: PBEPBE/SDD
title: #p freq=noraman PBEPBE/SDD
converged: YES YES NO NO
title: Mulliken charges:
elementType: S O O O O N C C C C C H H H H H H H
charge: 0.164389 -0.406865 -0.399590 -0.216983 -0.226221 -0.275378 -0.121051 -0.719763 -0.462680 0.161401 0.224630 0.283501 0.322378 0.274441 0.282120 0.336878 0.389616 0.389177
chargesum: 0.00000
title: Mulliken charges with hydrogens summed into heavy atoms:
elementType: S O O O O N C C C C C
charge: 0.164389 -0.017249 -0.010413 -0.216983 -0.226221 0.061499 0.162450 -0.163202 -0.140302 0.161401 0.224630
polarizability: 1.16405050e+02 -5.18183278e-01 9.17148024e+01 2.30421494e+00 1.87532589e+00 6.23714329e+01
1716.lowfreq: -15.8637 -4.9860 -0.0020 -0.0003 0.0008 4.7766 46.4207 68.8813 74.8724
frequency: 46.4164 68.8748 74.6522 89.4194 142.6178 182.0197 241.2704 295.7592 359.1883 371.4102 415.3644 522.1508 552.8797 595.8345 601.3718 616.2620 627.5812 671.2979 715.0587 724.0072 753.2704 850.1583 894.9328 937.7452 969.6191 1037.9664 1061.8485 1070.9585 1111.4620 1188.1500 1210.4447 1223.4296 1259.2700 1263.3156 1300.1120 1326.1759 1383.2610 1444.7933 1468.8735 1657.0310 1668.7072 3036.4159 3047.9817 3102.4056 3123.3351 3419.2491 3515.3364 3527.1483
redmass: 10.5726 9.2372 3.9969 5.2844 8.8735 6.3377 6.7271 7.9473 5.7744 6.7445 5.4646 3.6898 3.0065 1.7465 2.2122 3.7126 1.8633 3.0783 4.8273 4.4346 1.6349 3.2889 2.5593 2.8145 3.6036 1.9344 2.0766 1.6040 1.2993 1.9876 1.2345 1.4371 1.9556 1.5602 1.2195 2.0101 2.1336 1.1043 1.4181 8.5259 9.0717 1.0588 1.0842 1.0893 1.1089 1.0751 1.0641 1.0642
irintensity: 1.7891 0.6614 1.7404 2.8943 1.7481 1.7748 5.5134 1.5742 1.1981 5.9228 23.8929 94.1804 20.8363 4.0734 67.1622 34.3449 148.8378 47.1225 15.5628 61.6247 163.1392 2.5993 11.0845 12.4648 1.8479 64.1227 515.6181 40.7938 23.2935 10.4378 9.3342 9.8192 7.1842 0.7562 4.5692 194.3916 8.2841 5.6580 11.0632 99.2172 326.0410 18.6637 12.1444 8.1216 6.0380 44.3435 39.3018 43.6917
temp: 298.150 k
press: 1.00000 atm
elementType: 16 8 8 8 8 7 6 6 6 6 6 1 1 1 1 1 1 1
symmnumber: 1
zpe: 333559.7 jmol-1
zpe.correction: 0.127046 hartree
zpe.thermalcorrener: 0.138095 hartree
zpe.thermalcorrenthalpy: 0.139039 hartree
zpe.thermalcorrgfe: 0.088799 hartree
zpe.sumelectzpe: -947.598490 hartree
zpe.sumelectthermal: -947.587442 hartree
zpe.sumelectthermalent: -947.586498 hartree
zpe.sumelectthermalfe: -947.636737 hartree
dipole: -1.3858 1.1121 0.9874
dipole: 2.0327
quadrupole: -51.4633 -81.2605 -73.1525
quadrupole: -5.0607 1.1224 -3.2257
quadrupole: 17.1622 -12.6351 -4.5270 -5.0607 1.1224 -3.2257
hfenergy: -947.7255364 hartree
pointgroup: C01 [X(C5H7N1O4S1)]
dipole: 0.5586044 -0.458415 0.3426478 debye
dipolederiv: -0.2056885 0.0848174 0.0511959 -0.1429939 -0.3607759 -0.1489757 -0.1457153 -0.1619207 -0.3120723 -1.1308628 0.352151 -0.2761479 0.3430298 -0.4538786 0.0453779 -0.1858744 0.0247638 -0.4148149 -1.1817195 -0.2142533 0.3575766 -0.2624057 -0.3938937 0.0220272 0.2518794 -0.0064173 -0.4036376 -0.6951992 -0.1305035 0.0098897 0.0592238 -0.8188462 0.2097443 -0.0126954 0.2736237 -0.3946114 -0.6847267 0.1156544 -0.0002378 -0.0314449 -0.8017395 0.2335696 0.0142135 0.3535326 -0.451012 -0.5953882 -0.2636401 -0.1447699 -0.1111638 -0.7516662 -0.2916508 -0.0675927 -0.2901556 -0.4345316 0.0689949 -0.1545482 0.0267293 -0.3519738 0.1481202 0.1031012 0.1620586 0.1509845 0.3652771 0.092806 -0.0941893 -0.1227565 0.1732743 -0.0291551 -0.1328423 -0.0012027 -0.0418554 0.0217418 0.1522377 0.3935973 0.1155897 0.4569421 0.4904966 0.371942 -0.0215783 0.3097548 0.475472 1.6377676 -0.0138246 0.1872179 -0.1611629 1.0954744 -0.3878717 0.0493313 -0.447432 0.3769037 1.6427277 -0.1525851 -0.2938506 0.0180918 1.0340242 -0.3891894 -0.1146861 -0.5238136 0.4470683 0.0363143 0.0011569 0.0023538 0.0641968 0.0264471 0.051085 -0.0330011 0.0394648 -0.0458244 0.0398784 0.0239376 0.0240191 -0.0345796 -0.0039958 -0.0280714 0.0282973 -0.0207086 -0.0677162 -0.0288432 -0.024631 0.0611353 -0.0705551 0.037361 0.0934219 0.0523311 0.0295759 -0.0580805 -0.0386824 0.0906491 0.0088148 0.0618484 0.0165694 0.008384 0.0136447 0.0204966 0.0952949 0.2709793 0.0096997 0.0067369 0.0173207 0.3064809 0.0417011 0.0278113 0.0778924 0.1472043 0.2960795 -0.0755091 0.047177 -0.1142612 0.2145018 0.0874335 0.0793082 0.0952737 0.3447593 0.3233253 0.052021 -0.0606732 0.0866132 0.2444754 0.1108136 -0.0965296 0.1169406 0.3085795 unknown
polarizability: 116.351637|0.2103962|91.81423|-2.9261848|0.6701323|62.3254184 unknown
InChI: InChI=1S/C5H7NO4S/c7-4(8)2-1-11-3(6-2)5(9)10/h2-3,6-7,9H,1H2
charge 0 multiplicity 1
18 atoms
S  -0.961105 -1.905495 -0.457467
O  3.572733 -0.282461 0.442968
O  -3.57666 -0.049542 0.590868
O  2.407561 1.527906 -0.442518
O  -2.304539 1.542315 -0.538911
N  0.016654 0.489113 0.621563
C  1.173344 -0.398616 0.481361
C  0.858872 -1.457149 -0.6528
C  -1.196168 -0.25299 0.718805
C  2.408145 0.411719 0.117014
C  -2.376284 0.525042 0.185187
H  1.356984 -0.948191 1.42073
H  -1.389012 -0.697201 1.70429
H  1.026437 -1.025546 -1.652994
H  1.462779 -2.367371 -0.518198
H  -0.011506 1.254392 -0.071146
H  4.369723 0.241587 0.156783
H  -4.339757 0.441589 0.182365
