program: Orca
programVersion: 5.0.2
elementType: Br F F O O O C C C C C C C C C C C C C C C C C C C C C C C C H H H H H H H H H H H H H H H H H H H H H H H
charge: 0
multiplicity: 1
keywords: wb97x-d3
keywords: def2-TZVPP
keywords: def2/J RIJCOSX
keywords: DEFGRID2
keywords: scfconv7
keywords: smallprint printgap noloewdin
keywords: NOSOSCF
formula: C24H23BrF2O3
InChI: InChI=1/C24H23BrF2O3/c1-23(2,19-11-13-21(14-12-19)30-24(25,26)27)17-28-16-18-7-6-10-22(15-18)29-20-8-4-3-5-9-20/h3-15H,16-17H2,1-2H3
53 atoms
Br 1.711542 -1.465979 2.236679
F  3.034009 -1.600945 -0.093905
F  3.312531 -3.332281 1.144137
O  -3.945244 0.197578 0.633615
O  1.474321 -3.176209 0.063046
O  0.973623 3.455867 0.490277
C  -3.618026 -1.102985 -1.445872
C  -3.815236 0.265153 -0.76978
C  -2.261227 -1.677388 -1.061643
C  -3.672727 -0.871055 -2.96118
C  -4.774813 -2.02388 -1.063418
C  -2.121751 -2.839025 -0.308073
C  -1.091593 -1.014287 -1.440911
C  -2.778722 0.417159 1.39605
C  -0.872759 -3.309348 0.073355
C  0.165412 -1.472362 -1.084332
C  0.259275 -2.619796 -0.312542
C  -2.21604 1.80544 1.230504
C  -0.875623 1.976267 0.916038
C  -3.02954 2.926183 1.391269
C  -0.352081 3.255605 0.764605
C  -2.495717 4.196291 1.249436
C  -1.154781 4.371784 0.929388
C  2.40304 -2.470145 0.70662
C  1.582019 2.70497 -0.477667
C  2.897633 2.325354 -0.250495
C  0.94486 2.372752 -1.667971
C  3.579792 1.608796 -1.223042
C  1.637201 1.647988 -2.627701
C  2.953921 1.262471 -2.412656
H  -3.011564 0.949805 -1.067314
H  -4.747143 0.697624 -1.148368
H  -2.929991 -0.148956 -3.303248
H  -3.503059 -1.802131 -3.504135
H  -4.65347 -0.490631 -3.253749
H  -4.839373 -2.20561 0.009475
H  -4.69805 -2.992012 -1.562069
H  -5.720322 -1.573866 -1.372715
H  -2.990088 -3.398363 0.010741
H  -1.14609 -0.106744 -2.029017
H  -3.079516 0.265238 2.435991
H  -1.998412 -0.321596 1.185022
H  -0.784773 -4.208906 0.669238
H  1.039281 -0.931774 -1.421626
H  -0.240706 1.107206 0.785461
H  -4.078688 2.806786 1.632385
H  -3.127664 5.065414 1.379581
H  -0.738858 5.36409 0.808165
H  3.382413 2.592692 0.680191
H  -0.076977 2.678619 -1.85486
H  4.606076 1.31563 -1.043372
H  1.140248 1.389084 -3.553961
H  3.487574 0.699144 -3.166586
elementType: Br F O C H
totalener: -3928.11229568 hartree
nucrepener: 3673.11024241 hartree
electener: -7601.22253809 hartree
twoeener: 5141.28452764 hartree
cpcmener: -0.02123609 hartree
kineticenergy: 3918.78625289 hartree
xcener: -198.383101215272 hartree
chargesum: -0.0000000
charge: -0.077479 -0.154103 -0.149319 -0.384277 -0.263711 -0.333819 0.382784 -0.083038 -0.069767 -0.341873 -0.373054 -0.172508 -0.234920 0.141161 -0.117441 -0.134862 0.117156 0.009456 -0.162569 -0.249288 0.249487 -0.118345 -0.235408 0.429214 0.292846 -0.231621 -0.195261 -0.144547 -0.164786 -0.162864 0.107588 0.115594 0.101939 0.108652 0.103968 0.094909 0.110085 0.104131 0.143009 0.142172 0.112811 0.066747 0.147465 0.163000 0.100351 0.137254 0.156438 0.145983 0.143496 0.156173 0.156514 0.158248 0.156229
qa: -0.0775 -0.1541 -0.1493 -0.3843 -0.2637 -0.3338 0.3828 -0.0830 -0.0698 -0.3419 -0.3731 -0.1725 -0.2349 0.1412 -0.1174 -0.1349 0.1172 0.0095 -0.1626 -0.2493 0.2495 -0.1183 -0.2354 0.4292 0.2928 -0.2316 -0.1953 -0.1445 -0.1648 -0.1629 0.1076 0.1156 0.1019 0.1087 0.1040 0.0949 0.1101 0.1041 0.1430 0.1422 0.1128 0.0667 0.1475 0.1630 0.1004 0.1373 0.1564 0.1460 0.1435 0.1562 0.1565 0.1582 0.1562
va: 1.1757 1.1285 1.1467 1.9344 2.1186 2.0772 3.5819 3.9528 3.6039 3.9314 3.9237 3.9319 3.9767 3.8484 4.0079 3.8834 3.8414 3.5763 3.9021 3.9806 3.7442 3.8976 4.0018 4.5525 3.6744 3.9830 3.8502 3.8606 3.8440 3.8457 0.9916 1.0072 1.0001 1.0023 1.0045 1.0148 0.9994 1.0052 0.9984 0.9974 0.9918 0.9933 1.0044 1.0024 1.0166 1.0146 0.9889 1.0061 1.0084 0.9983 0.9890 0.9923 0.9907
dispcorr: -0.034686248 hartree
energy: -3928.146981932231
dipole: -57.44359 56.34930 -1.09429 25.74084 -25.70344 0.03740 -40.86275 39.77678 -1.08597
magnitude: 1.54214 au
magnitude: 3.91981 debye
