program: Orca
programVersion: 5.0.2
elementType: Br F F O O O C C C C C C C C C C C C C C C C C C C C C C C C H H H H H H H H H H H H H H H H H H H H H H H
charge: 0
multiplicity: 1
keywords: wb97x-d3
keywords: def2-TZVPP
keywords: def2/J RIJCOSX
keywords: DEFGRID2
keywords: scfconv7
keywords: smallprint printgap noloewdin
keywords: NOSOSCF
formula: C24H23BrF2O3
InChI: InChI=1/C24H23BrF2O3/c1-23(2,19-11-13-21(14-12-19)30-24(25,26)27)17-28-16-18-7-6-10-22(15-18)29-20-8-4-3-5-9-20/h3-15H,16-17H2,1-2H3
53 atoms
Br 2.37563 -3.936789 -0.272617
F  2.48451 -2.514691 1.998565
F  3.969103 -1.944244 0.55961
O  -3.821458 0.965745 0.083883
O  1.97614 -1.238144 0.251807
O  0.190844 4.293507 -0.853756
C  -3.606301 -1.238062 -0.92412
C  -4.301897 -0.359823 0.125019
C  -2.111569 -1.263876 -0.627734
C  -3.912437 -0.690891 -2.317928
C  -4.199516 -2.647244 -0.825173
C  -1.167944 -0.67757 -1.466923
C  -1.639846 -1.857633 0.544202
C  -3.180018 1.407984 1.262083
C  0.187116 -0.698802 -1.165601
C  -0.294412 -1.876714 0.875022
C  0.614864 -1.301758 0.001362
C  -2.59771 2.763127 0.985758
C  -1.436699 2.865064 0.223406
C  -3.234157 3.915049 1.430351
C  -0.915577 4.116042 -0.074001
C  -2.709088 5.162422 1.119957
C  -1.548042 5.270449 0.373501
C  2.688528 -2.270675 0.697247
C  1.196588 3.365256 -0.867128
C  1.692767 2.980284 -2.103537
C  1.75898 2.878019 0.306901
C  2.77149 2.108232 -2.164686
C  2.828456 1.998916 0.230591
C  3.340459 1.611167 -1.00134
H  -5.379168 -0.349555 -0.081337
H  -4.178841 -0.79828 1.122311
H  -3.449483 -1.29911 -3.097168
H  -4.990349 -0.708098 -2.490804
H  -3.579497 0.337929 -2.456351
H  -4.07944 -3.087066 0.165566
H  -3.732435 -3.319734 -1.546009
H  -5.269639 -2.624865 -1.041832
H  -1.471088 -0.193412 -2.384623
H  -2.332032 -2.313609 1.240812
H  -3.889378 1.468159 2.096521
H  -2.387371 0.71218 1.560688
H  0.903548 -0.243362 -1.837788
H  0.010308 -2.330074 1.807743
H  -0.950337 1.962898 -0.130577
H  -4.141001 3.83856 2.017527
H  -3.204374 6.060151 1.466509
H  -1.132194 6.240889 0.133068
H  1.244733 3.369216 -3.009431
H  1.376311 3.185594 1.272228
H  3.161556 1.813383 -3.130308
H  3.268413 1.620903 1.1443
H  4.176734 0.926512 -1.051853
elementType: Br F O C H
totalener: -3928.11280278 hartree
nucrepener: 3553.36068693 hartree
electener: -7481.47348971 hartree
twoeener: 5022.26260574 hartree
cpcmener: -0.02345694 hartree
kineticenergy: 3918.80295879 hartree
xcener: -198.381745153315 hartree
chargesum: 0.0000000
charge: -0.073531 -0.159275 -0.152680 -0.379099 -0.251923 -0.329798 0.386931 -0.077219 -0.022331 -0.363520 -0.336815 -0.211156 -0.243838 0.066000 -0.157312 -0.117348 0.129444 -0.030030 -0.147717 -0.196704 0.250397 -0.121154 -0.247870 0.420969 0.287570 -0.239858 -0.185862 -0.130887 -0.142981 -0.179026 0.106827 0.101361 0.110664 0.103029 0.095223 0.100991 0.107760 0.103419 0.141181 0.140351 0.099992 0.100521 0.166791 0.157374 0.121229 0.138941 0.155970 0.144918 0.144044 0.153342 0.155455 0.155587 0.151655
qa: -0.0735 -0.1593 -0.1527 -0.3791 -0.2519 -0.3298 0.3869 -0.0772 -0.0223 -0.3635 -0.3368 -0.2112 -0.2438 0.0660 -0.1573 -0.1173 0.1294 -0.0300 -0.1477 -0.1967 0.2504 -0.1212 -0.2479 0.4210 0.2876 -0.2399 -0.1859 -0.1309 -0.1430 -0.1790 0.1068 0.1014 0.1107 0.1030 0.0952 0.1010 0.1078 0.1034 0.1412 0.1404 0.1000 0.1005 0.1668 0.1574 0.1212 0.1389 0.1560 0.1449 0.1440 0.1533 0.1555 0.1556 0.1517
va: 1.1814 1.1306 1.1400 1.9164 2.1197 2.0779 3.5627 3.9612 3.5929 3.9148 3.9285 3.9366 4.0471 3.8944 3.9523 3.9728 3.8259 3.7229 3.8766 3.9360 3.7547 3.9105 3.9932 4.5736 3.6699 3.9863 3.9056 3.8518 3.8349 3.8421 1.0074 0.9926 0.9998 1.0056 1.0147 1.0021 1.0020 1.0043 1.0030 1.0075 0.9962 0.9776 0.9929 1.0084 1.0144 1.0043 0.9892 1.0081 1.0078 0.9976 0.9901 0.9937 0.9977
dispcorr: -0.032415368 hartree
energy: -3928.145218146780
dipole: -65.78957 64.48234 -1.30723 54.42868 -55.13196 -0.70328 -6.37859 6.85129 0.47270
magnitude: 1.55785 au
magnitude: 3.95974 debye
